program: Gaussian 09
title: 000168696
version: EM64L-G09RevD.01
frameworkgroup: C1[X(C14H22O)]
method: RPBEPBE
basis: SDD
operation: Freq
keyword: #pfreq=noraman
keyword: PBEPBE/SDD
title: #p freq=noraman PBEPBE/SDD
converged: YES YES NO NO
title: Mulliken charges:
elementType: O C C C C C C C C C C C C C C H H H H H H H H H H H H H H H H H H H H H H
charge: -0.236600 0.355327 -0.327851 -0.458992 -0.420626 0.529482 -0.584755 -0.774918 -0.756039 -0.115697 -0.771747 -0.369774 0.195884 -0.488737 -0.679999 0.213691 0.211986 0.193438 0.221217 0.206163 0.220913 0.201387 0.237328 0.213075 0.227442 0.212732 0.205090 0.234308 0.294579 0.240649 0.219045 0.227314 0.228891 0.228103 0.229359 0.207495 0.230836
chargesum: 0.00000
title: Mulliken charges with hydrogens summed into heavy atoms:
elementType: O C C C C C C C C C C C C C C
charge: -0.236600 0.355327 -0.114160 -0.053568 0.006754 0.529482 -0.162455 -0.097073 -0.103909 0.178882 -0.312053 -0.142460 0.195884 -0.031744 -0.012308
polarizability: 2.01070483e+02 1.82063757e+00 1.38596746e+02 1.25404921e+00 7.00499496e+00 1.29207980e+02
1716.lowfreq: -8.9203 -0.0006 -0.0005 -0.0001 8.7975 16.0551 29.0748 45.6764 53.7131
frequency: 28.3211 45.4881 53.4257 67.3392 98.1423 122.0550 134.1634 176.3561 193.6659 203.3768 220.8677 244.2993 266.1923 284.2370 288.5413 323.9959 362.8261 372.0888 404.2024 426.8306 441.6074 455.6102 491.3285 542.6497 555.0789 592.7506 644.4000 693.4979 752.9022 778.6593 816.3669 828.1616 851.0044 876.4559 888.1178 903.7092 930.8601 938.2116 942.8354 965.2554 986.2707 996.7036 1008.1458 1026.0627 1032.7121 1042.2435 1067.5323 1076.3710 1103.8589 1116.8167 1138.9417 1148.5767 1180.6653 1207.6547 1213.0439 1228.5225 1237.9087 1257.4920 1266.7816 1293.2427 1299.5449 1314.0593 1324.1989 1336.3472 1344.1226 1351.9440 1380.8343 1396.0017 1401.3304 1429.2898 1430.7358 1452.6100 1460.1255 1464.7544 1468.2929 1471.2289 1475.2175 1477.6316 1483.2387 1500.5488 1580.6512 1656.1471 1659.0602 2930.3313 2948.8867 2954.4355 2957.0176 2967.2090 2979.6695 2987.5329 2996.1870 3000.5734 3017.7488 3037.3705 3048.2133 3058.2489 3068.4874 3075.7104 3081.4980 3089.9723 3092.1329 3093.6611 3098.2871 3101.2213 3192.0722
redmass: 4.0002 1.8602 3.3285 5.3801 3.7886 2.4717 2.0429 2.1796 1.3044 2.6822 1.5255 1.2454 2.0760 2.6637 2.2638 2.7361 2.6870 2.4582 3.0365 2.1965 2.9048 2.6105 2.8848 2.2990 2.6718 2.8746 3.4199 1.3756 1.8199 1.6472 2.1975 2.7919 1.5107 2.3073 1.7348 2.6682 1.6995 1.3565 1.6486 1.9805 1.6470 1.4171 1.8467 1.2585 1.6313 2.0199 1.6712 1.7345 1.5002 2.1444 1.9772 2.3807 1.4622 2.3245 1.5199 1.5639 1.1927 1.4709 1.7772 1.6956 1.3739 1.3683 1.8184 1.4577 1.4921 2.0326 1.1993 1.2130 1.2008 1.1679 1.0979 1.0867 1.0917 1.0572 1.0395 1.0619 1.0736 1.0522 1.0559 1.0561 8.1946 6.2479 5.3732 1.0813 1.0657 1.0609 1.0604 1.0365 1.0368 1.0623 1.0364 1.0973 1.0977 1.0954 1.1022 1.0986 1.0987 1.0988 1.0988 1.0654 1.1003 1.0895 1.0996 1.0880 1.1136
irintensity: 1.9713 1.6893 0.5911 0.8763 0.7061 0.0670 0.0293 0.0543 0.4690 0.1697 0.2415 0.7525 1.2889 7.7650 0.1534 3.0128 0.0392 2.1051 6.2273 1.0452 2.0486 1.6285 2.5955 0.2432 6.4784 4.3775 1.4038 0.1327 1.0197 5.7011 3.5545 8.8493 10.5641 3.5345 6.7500 2.7947 4.0017 67.0012 8.0374 2.1533 5.3474 9.9459 6.7511 23.0448 21.2593 27.0760 1.4156 2.7365 9.7164 26.7338 4.9595 40.8906 18.7806 3.8100 2.0653 39.4195 0.0656 4.9090 56.5107 4.8902 2.9448 0.2822 12.6197 1.5051 2.1408 59.0817 20.4089 24.2698 18.4895 7.3951 21.6922 7.2059 9.0865 5.4240 11.9066 8.0565 15.7331 16.6525 7.1251 6.6387 151.7087 105.0713 28.5125 14.9492 30.3874 38.8893 32.5329 42.4413 18.3248 39.6239 30.5401 12.1438 46.4466 49.5893 42.7874 45.0444 21.3174 53.6997 29.9574 7.3788 29.5679 0.3069 30.9506 17.8919 21.8322
temp: 298.150 k
press: 1.00000 atm
elementType: 8 6 6 6 6 6 6 6 6 6 6 6 6 6 6 1 1 1 1 1 1 1 1 1 1 1 1 1 1 1 1 1 1 1 1 1 1
symmnumber: 1
zpe: 847971.8 jmol-1
zpe.correction: 0.322975 hartree
zpe.thermalcorrener: 0.339938 hartree
zpe.thermalcorrenthalpy: 0.340882 hartree
zpe.thermalcorrgfe: 0.278102 hartree
zpe.sumelectzpe: -620.704570 hartree
zpe.sumelectthermal: -620.687607 hartree
zpe.sumelectthermalent: -620.686663 hartree
zpe.sumelectthermalfe: -620.749443 hartree
dipole: -2.1568 -0.4529 -2.9566
dipole: 3.6876
quadrupole: -91.0059 -92.9552 -95.1562
quadrupole: -0.0851 -8.5625 0.3212
quadrupole: 2.0332 0.0839 -2.1171 -0.0851 -8.5625 0.3212
hfenergy: -621.0275456 hartree
pointgroup: C01 [X(C14H22O1)]
dipole: -0.8432754 0.1909368 1.1650435 debye
polarizability: 201.0121022|-2.5409459|138.6816437|-1.3574465|7.0036362|129.1814636 unknown
InChI: InChI=1S/C14H22O/c1-5-12(15)8-9-13-11(2)7-6-10-14(13,3)4/h8-9,13H,2,5-7,10H2,1,3-4H3
charge 0 multiplicity 1
37 atoms
O  3.165557 -0.018964 -1.342001
C  -1.735323 1.180304 -0.085492
C  -0.878932 -0.077232 0.393658
C  -3.149847 1.074571 0.562276
C  -3.885332 -0.243875 0.24247
C  -1.620853 -1.390737 0.089592
C  -3.026375 -1.461986 0.669366
C  -1.84918 1.22338 -1.633103
C  -1.061578 2.482968 0.41461
C  0.519682 -0.054934 -0.168424
C  -1.078831 -2.422365 -0.609746
C  1.669813 -0.012705 0.561628
C  3.017784 -0.012991 -0.082862
C  4.217155 -0.009701 0.870543
C  5.578409 -0.053764 0.158984
H  -0.816512 0.010508 1.502097
H  -3.755807 1.94111 0.229864
H  -3.041653 1.166986 1.664113
H  -4.104906 -0.305602 -0.840511
H  -4.858889 -0.268719 0.769014
H  -3.513415 -2.408609 0.371605
H  -2.958173 -1.465211 1.779052
H  -2.171496 0.254249 -2.053201
H  -2.584238 1.991929 -1.937901
H  -0.883383 1.487465 -2.100087
H  -1.668401 3.363084 0.129081
H  -0.96125 2.484214 1.517438
H  -0.052759 2.610232 -0.017278
H  0.629847 -0.084666 -1.263283
H  -0.059692 -2.392053 -1.009408
H  -1.649938 -3.341038 -0.791252
H  1.636965 0.005709 1.660502
H  4.10234 -0.869683 1.563975
H  4.134166 0.892697 1.513417
H  5.668079 -0.963526 -0.459288
H  6.405748 -0.041654 0.890909
H  5.694022 0.808511 -0.519758
