program: Gaussian 09
title: 000168847
version: EM64L-G09RevD.01
frameworkgroup: C1[X(C19H28O6S)]
method: RPBEPBE
basis: SDD
operation: Freq
keyword: #p
keyword: freq=noraman
keyword: PBEPBE/SDD
title: #p freq=noraman PBEPBE/SDD
converged: NO YES NO NO
title: Mulliken charges:
elementType: S O O O O O O C C C C C C C C C C C C C C C C C C C H H H H H H H H H H H H H H H H H H H H H H H H H H H H
charge: 1.186991 -0.372055 -0.258163 -0.445024 -0.543255 -0.459788 -0.489365 -0.093146 -0.173551 -0.151987 0.293633 0.262097 -0.543180 -0.522424 -0.588636 -0.498159 0.487606 0.159487 -0.185494 -0.514150 -0.782718 -0.479915 -0.829133 -0.655696 -0.475658 -0.042216 0.202714 0.252841 0.225113 0.231577 0.227105 0.215748 0.231516 0.255042 0.246736 0.222608 0.212784 0.297152 0.208506 0.215253 0.245004 0.247474 0.245137 0.217871 0.233526 0.223291 0.222556 0.239576 0.228499 0.222477 0.197809 0.200093 0.332192 0.413697
chargesum: 0.00000
title: Mulliken charges with hydrogens summed into heavy atoms:
elementType: S O O O O O O C C C C C C C C C C C C C C C C C C C
charge: 1.186991 -0.372055 -0.258163 -0.112832 -0.129558 -0.459788 -0.489365 0.109568 0.079290 0.073126 0.293633 0.262097 -0.084497 -0.075160 -0.086857 -0.062767 0.487606 0.159487 0.111658 -0.090391 -0.045103 -0.262044 -0.149759 -0.187621 -0.055372 0.157877
polarizability: 3.48348433e+02 -1.12012101e+01 2.18985626e+02 1.14398128e+00 -1.79028946e+00 1.81633579e+02
1716.lowfreq: -19.1148 -6.6635 0.0017 0.0018 0.0021 3.0120 21.2455 32.1778 50.4596
frequency: 21.1763 31.9900 50.0184 55.6389 64.7794 85.7261 105.1080 134.1068 147.4948 157.4684 173.4659 184.2397 187.5232 198.3940 224.9194 237.1420 244.8647 250.3427 262.0954 279.0621 279.5517 285.4913 291.2477 298.3109 303.7405 320.0214 328.0741 340.2504 347.2356 370.7354 379.4739 389.3589 407.0356 422.3895 444.6821 450.8077 475.1141 480.9434 512.0263 533.6796 546.1412 564.7685 587.3700 596.2115 609.9251 615.7165 681.3272 705.9673 729.5752 758.7829 792.6742 804.2919 813.2211 828.1439 834.0224 840.0043 861.2908 863.0390 882.8331 909.9291 914.7068 933.9232 939.6117 953.6321 976.8557 987.6856 991.3095 1000.1166 1002.7432 1012.0311 1017.2763 1024.4857 1035.9656 1045.5213 1060.5074 1069.6730 1076.0763 1092.1284 1104.4091 1116.8791 1119.8855 1130.8999 1138.6838 1146.7776 1156.1378 1166.3789 1182.3624 1187.9929 1204.5771 1212.2965 1233.2846 1244.3205 1245.3452 1250.0503 1260.1505 1267.9037 1274.2811 1288.3500 1293.0422 1296.8171 1300.4518 1313.1712 1324.3399 1326.1409 1331.3219 1334.5227 1341.8857 1347.7447 1352.9529 1357.1844 1365.1793 1369.6138 1380.0666 1385.5266 1390.6953 1455.4722 1456.7251 1460.9994 1462.5251 1466.6851 1470.8623 1473.4654 1483.9817 1485.4183 1490.6907 1497.2486 1615.9982 1685.5327 2618.5239 2910.9072 2923.0046 2925.6898 2927.6491 2930.8982 2960.7697 2976.6961 2978.2363 2980.4869 2981.7877 2983.8797 2993.6464 2998.5353 3002.6858 3026.9758 3028.0871 3041.8660 3044.5828 3056.1064 3056.6234 3073.7154 3084.3218 3088.2098 3094.2598 3100.3961 3100.7767 3553.7901
redmass: 6.2251 6.9776 4.3350 4.5917 6.6302 5.2452 4.1136 4.9974 4.1601 5.1359 3.2608 1.4444 7.1629 1.7132 2.9594 4.0910 1.5881 2.8039 4.2623 3.2357 2.3770 3.8635 2.1561 2.2278 1.7727 2.6868 3.0797 9.2964 5.0171 3.1140 7.2364 2.7423 3.8492 3.9391 2.9543 2.4591 3.9024 3.1323 3.4234 4.0635 4.3053 4.6176 3.0638 3.2198 6.1093 5.5690 3.0536 3.1626 3.5468 3.8096 1.8847 1.8094 1.3565 1.6285 1.7635 2.4488 10.0347 2.5086 1.6741 1.8546 1.9157 2.0560 2.0225 1.9348 1.8789 2.2464 2.4033 10.8617 2.8627 1.9153 2.1147 2.5279 2.5779 2.3316 2.1991 2.6100 3.0537 2.0244 1.9564 2.1430 1.5903 2.0714 1.6891 1.7022 2.0688 1.7434 2.2461 1.7594 1.6813 1.5238 1.4576 1.3418 2.3244 1.3815 1.4909 1.3107 1.3595 1.3865 1.3788 1.3127 1.3231 1.3032 1.4707 1.4523 1.4619 1.3109 1.4061 1.5417 1.4119 1.1540 1.4615 1.4719 1.1824 1.5031 1.3084 1.0824 1.0881 1.0828 1.0730 1.0661 1.0796 1.0841 1.0738 1.0742 1.0607 1.0622 9.4834 7.8619 1.0783 1.0812 1.0778 1.0703 1.0800 1.0840 1.0620 1.0623 1.0608 1.0773 1.0647 1.0432 1.0374 1.0634 1.0859 1.0624 1.0975 1.1000 1.0987 1.0995 1.0996 1.0990 1.0973 1.0995 1.0901 1.1031 1.1007 1.0660
irintensity: 1.4263 0.2286 0.4728 0.6775 1.4331 1.2330 0.9546 3.0230 6.3533 0.2352 4.7155 1.5406 0.2561 0.8267 0.5729 1.1143 3.2827 2.6778 0.5987 5.2558 3.4914 2.3378 12.7944 41.8000 67.8210 8.7936 27.5565 15.1450 4.9008 19.6869 20.8894 0.8774 4.8630 10.9598 6.0219 13.4230 3.5928 7.1031 53.5259 20.4588 0.9170 4.3520 6.8167 3.2009 56.0763 39.7194 0.4316 0.4706 27.3441 3.2565 1.4297 2.5648 103.1778 33.4640 10.4143 8.6395 157.2358 0.7675 4.6911 25.7399 2.1642 7.1372 7.9856 48.3893 20.1267 8.8486 17.6022 98.8624 41.0635 31.8167 14.3024 33.7982 7.3710 10.2178 1.7143 0.9936 5.1859 19.7183 7.1029 9.6449 3.8894 3.8103 8.8014 13.8014 8.7537 16.1064 5.0783 6.1227 2.9428 7.2308 0.8489 5.4817 14.1410 7.3197 3.2746 2.8846 0.6460 16.2715 2.2421 1.4852 0.4569 0.0645 1.4030 6.4988 1.5630 0.5063 1.9232 1.6068 14.0636 180.6303 10.2256 5.4585 16.6625 13.1357 13.7886 6.7637 7.9360 11.3604 4.2198 6.3498 3.2497 12.8700 14.0990 18.1033 6.8240 8.1365 169.8339 2.3732 1130.4939 9.1713 9.8276 45.9591 25.3797 40.2754 32.1726 46.5322 27.9572 6.6256 20.5297 33.5470 4.1931 28.4493 39.4627 16.5302 22.9618 50.4917 32.7680 12.3582 61.2907 27.9454 40.9596 18.9032 41.2326 8.6221 16.7725 2.7162
temp: 298.150 k
press: 1.00000 atm
elementType: 16 8 8 8 8 8 8 6 6 6 6 6 6 6 6 6 6 6 6 6 6 6 6 6 6 6 1 1 1 1 1 1 1 1 1 1 1 1 1 1 1 1 1 1 1 1 1 1 1 1 1 1 1 1
symmnumber: 1
zpe: 1162803.4 jmol-1
zpe.correction: 0.442888 hartree
zpe.thermalcorrener: 0.468665 hartree
zpe.thermalcorrenthalpy: 0.469609 hartree
zpe.thermalcorrgfe: 0.388483 hartree
zpe.sumelectzpe: -1588.002501 hartree
zpe.sumelectthermal: -1587.976725 hartree
zpe.sumelectthermalent: -1587.975781 hartree
zpe.sumelectthermalfe: -1588.056907 hartree
dipole: -8.6296 2.1052 -0.9544
dipole: 8.9338
quadrupole: -229.7249 -165.4395 -163.9113
quadrupole: -6.3851 10.5256 1.0712
quadrupole: -43.3663 20.9191 22.4473 -6.3851 10.5256 1.0712
hfenergy: -1588.4453898 hartree
pointgroup: C01 [X(C19H28O6S1)]
dipole: 3.4038917 -0.8464944 -0.2257752 debye
polarizability: 348.504157|-10.1733865|218.5415159|1.7797146|-3.7135241|181.9219645 unknown
InChI: InChI=1S/C19H28O6S/c1-18-7-5-12(20)9-11(18)3-4-13-14(18)6-8-19(2)15(13)10-16(17(19)21)25-26(22,23)24/h3,12-16,20,22H,4-10H2,1-2H3
charge 0 multiplicity 1
54 atoms
S  -6.080541 0.484323 -0.399228
O  -4.466368 0.808543 0.585153
O  -3.704719 -1.972805 -0.130297
O  7.152534 0.80298 -0.4442
O  -6.243444 -1.258955 -0.136308
O  -7.24181 1.236077 0.388072
O  -5.733089 0.803206 -1.942586
C  1.4857 -0.554792 -0.224765
C  0.556188 0.575798 0.331804
C  -0.890961 0.294006 -0.116715
C  -1.413006 -1.107102 0.331133
C  2.981074 -0.374524 0.245956
C  0.936662 -1.989628 0.050101
C  -0.551792 -2.19714 -0.340283
C  -2.030873 1.279024 0.263817
C  1.030058 1.953148 -0.184751
C  3.414884 1.098745 0.089351
C  -2.883019 -1.014349 -0.038834
C  -3.276694 0.47869 -0.197547
C  3.898985 -1.253454 -0.675643
C  -1.454142 -1.293003 1.889861
C  2.5323 2.113003 -0.119319
C  3.172291 -0.802931 1.73455
C  4.907892 1.390538 0.190621
C  5.411737 -0.992362 -0.490324
C  5.740784 0.490682 -0.737839
H  1.490495 -0.41541 -1.330872
H  0.608944 0.584279 1.439539
H  -0.861158 0.265198 -1.231545
H  1.060182 -2.238407 1.119705
H  1.545533 -2.725792 -0.507387
H  -0.666348 -2.126018 -1.440464
H  -0.887276 -3.207915 -0.042656
H  -1.963517 2.251795 -0.247473
H  -2.076065 1.461597 1.352089
H  0.54544 2.763002 0.397192
H  0.686355 2.093728 -1.234527
H  -3.465967 0.671584 -1.279105
H  3.627711 -1.051401 -1.733178
H  3.692782 -2.32456 -0.490558
H  -2.108099 -0.556506 2.388973
H  -1.839666 -2.300147 2.124925
H  -0.444973 -1.19166 2.319617
H  2.923309 3.133191 -0.245919
H  4.171907 -0.522629 2.107411
H  2.432334 -0.309473 2.390092
H  3.072814 -1.896832 1.856927
H  5.109616 2.450363 -0.044796
H  5.279037 1.217212 1.221345
H  5.737843 -1.259216 0.533304
H  5.985071 -1.635003 -1.189561
H  5.51086 0.739822 -1.799008
H  7.732374 0.240946 -1.018835
H  -5.274169 -1.662566 -0.179111
