program: Gaussian 09
title: 000168708
version: EM64L-G09RevD.01
frameworkgroup: C1[X(C18H20O5S)]
method: RPBEPBE
basis: SDD
operation: Freq
keyword: #p
keyword: freq=noraman
keyword: PBEPBE/SDD
title: #p freq=noraman PBEPBE/SDD
converged: YES YES NO NO
title: Mulliken charges:
elementType: S O O O O O C C C C C C C C C C C C C C C C C C H H H H H H H H H H H H H H H H H H H H
charge: 1.109863 -0.174287 -0.397870 -0.559767 -0.465710 -0.478369 0.298765 -0.288069 -0.510420 -0.309720 0.422235 -0.516694 -0.475180 0.051207 -0.502539 -0.775748 0.293970 -0.471801 -0.579630 0.314639 -0.354973 -0.498878 -0.356092 0.291650 0.227036 0.209080 0.246397 0.225396 0.237066 0.217986 0.237959 0.223462 0.250432 0.250798 0.227357 0.241815 0.243572 0.232032 0.240762 0.237003 0.247928 0.272562 0.266404 0.398370
chargesum: 0.00000
title: Mulliken charges with hydrogens summed into heavy atoms:
elementType: S O O O O O C C C C C C C C C C C C C C C C C C
charge: 1.109863 -0.174287 -0.397870 -0.161397 -0.465710 -0.478369 0.298765 -0.061033 -0.054944 -0.084323 0.422235 -0.061642 -0.013759 0.051207 -0.001309 -0.063005 0.293970 -0.239769 -0.101865 0.314639 -0.107044 -0.226316 -0.089688 0.291650
polarizability: 4.65840357e+02 -6.86319511e+00 2.13557847e+02 3.65894603e+01 1.07859556e+01 1.76514039e+02
1716.lowfreq: -13.9197 -4.5400 -0.3801 -0.0012 0.0013 0.0021 20.4333 21.2536 27.2707
frequency: 19.8932 21.1434 26.9120 46.1988 57.4786 74.9623 99.0743 108.6532 135.1727 139.3156 143.8958 155.9416 191.3274 205.0762 222.6982 232.1646 256.8688 266.2713 274.9053 279.3845 291.0705 302.5832 319.4812 342.8012 373.3041 386.7662 411.1380 419.4854 439.4014 460.3295 472.9901 506.0113 526.2077 539.7671 544.6644 550.3808 573.0510 589.7948 603.3407 628.4299 687.8440 708.8520 715.0965 758.9045 787.5362 818.5618 821.2146 825.8353 837.4720 845.0808 855.4296 887.7705 902.0652 906.0349 931.8921 946.8806 959.8253 965.3108 972.4931 975.3536 979.9374 1005.9469 1017.6534 1038.3530 1055.6098 1058.0150 1081.7704 1091.4340 1110.5462 1118.6694 1144.3099 1161.6642 1169.7583 1183.8349 1195.8329 1200.2375 1203.1963 1216.6020 1236.8570 1244.8549 1254.0802 1263.4170 1268.4472 1278.0860 1288.6922 1293.3402 1313.7943 1327.3047 1330.6492 1348.8284 1373.3192 1382.8296 1386.8134 1421.7440 1430.3007 1449.4862 1458.7251 1464.1199 1469.6286 1472.5457 1484.9595 1492.0216 1534.2323 1594.6078 1655.9240 1713.5185 2899.1993 2907.6692 2947.6024 2980.9129 2982.0751 2987.6295 2998.3436 3001.6052 3012.0172 3047.7937 3058.8174 3060.5997 3075.4337 3080.9290 3092.4856 3114.3404 3134.1384 3143.1343 3173.3967 3451.2956
redmass: 6.6379 9.1170 8.4830 5.0032 5.1509 6.5020 4.4889 5.1451 4.6166 5.1363 1.2525 3.8350 2.7491 3.7207 2.1327 3.8222 4.1328 2.9521 3.5714 3.3084 3.4610 3.5042 2.2326 4.4709 2.5901 4.7728 5.3043 4.0349 2.9498 4.7839 6.0140 5.2889 4.5336 3.1871 2.7860 4.3544 4.4648 4.2126 3.8539 4.2386 2.4857 3.8206 4.7333 4.2588 2.6687 1.6501 2.4346 1.4512 1.7438 9.1075 2.1584 2.5644 1.5069 2.7953 3.0234 14.9549 1.9875 1.5356 1.7823 1.9500 2.0752 2.1325 2.1520 1.8750 3.0060 2.4370 2.6655 1.1744 1.7772 1.5070 1.8487 1.8297 1.4725 1.6221 1.1920 1.4234 1.8566 2.4789 2.4364 1.8351 1.3646 1.4038 1.5098 1.4634 1.4528 1.8132 1.3825 1.5829 1.5361 1.9328 3.5420 1.3165 1.6660 3.8987 1.0837 1.1696 1.0770 1.1277 1.2968 1.6350 1.0865 1.0655 6.3046 6.5402 12.0718 7.7079 1.0808 1.0799 1.0620 1.0627 1.0959 1.0359 1.0602 1.0614 1.0635 1.0982 1.1032 1.0987 1.1014 1.1001 1.1002 1.0907 1.0892 1.0922 1.0962 1.0653
irintensity: 2.0273 0.8204 0.5894 2.4183 2.8647 9.9431 4.0429 16.6154 3.7450 0.9176 0.2477 22.4911 1.0166 16.8275 3.3168 16.0970 37.9690 14.1146 28.1356 8.0145 6.3211 17.1265 34.4074 14.0678 15.7179 29.3951 12.6282 4.8414 3.9100 13.2554 2.0114 62.0194 12.7021 83.5465 0.7383 125.2514 2.7399 0.6599 5.8223 0.6180 0.9322 6.3459 1.8817 1.5674 0.5452 15.1110 16.3166 11.0855 4.4898 102.9747 4.8847 2.9360 39.8238 16.7794 4.3749 70.3633 3.4737 1.7943 0.4571 9.0958 9.0330 43.6722 3.2056 12.6392 24.2327 42.3979 4.3516 204.8061 31.5584 10.4002 10.0302 45.2761 3.5086 7.1237 1.4499 1.2970 1.7237 32.8289 71.4353 1.4706 5.0744 31.3724 4.0229 1.9834 2.0172 4.2099 0.4766 0.7985 1.3935 14.9349 10.5225 15.7800 6.7960 11.8189 18.0741 17.5720 5.3575 7.1823 13.4729 23.2170 8.8395 10.0959 85.6496 157.8962 206.1611 4.9658 9.5001 31.1041 21.5211 26.9190 11.8107 11.9171 17.4313 18.4299 18.2161 20.4219 35.1212 9.2547 39.3973 17.7851 18.8471 33.1246 14.3924 1.4902 2.4278 106.2997
temp: 298.150 k
press: 1.00000 atm
elementType: 16 8 8 8 8 8 6 6 6 6 6 6 6 6 6 6 6 6 6 6 6 6 6 6 1 1 1 1 1 1 1 1 1 1 1 1 1 1 1 1 1 1 1 1
symmnumber: 1
zpe: 895785.9 jmol-1
zpe.correction: 0.341187 hartree
zpe.thermalcorrener: 0.364528 hartree
zpe.thermalcorrenthalpy: 0.365472 hartree
zpe.thermalcorrgfe: 0.286764 hartree
zpe.sumelectzpe: -1470.129914 hartree
zpe.sumelectthermal: -1470.106573 hartree
zpe.sumelectthermalent: -1470.105629 hartree
zpe.sumelectthermalfe: -1470.184336 hartree
dipole: -5.7879 3.6255 -3.1064
dipole: 7.5029
quadrupole: -207.9551 -148.8276 -146.5453
quadrupole: -11.3114 -15.0119 5.2445
quadrupole: -40.1791 18.9484 21.2307 -11.3114 -15.0119 5.2445
hfenergy: -1470.4711006 hartree
pointgroup: C01 [X(C18H20O5S1)]
dipole: 2.2119295 -1.3934536 -1.3708325 debye
polarizability: 463.4109267|-10.2373084|215.1384691|-44.5625044|-7.1690392|177.362848 unknown
InChI: InChI=1S/C18H19O2.HO3S/c1-18-9-8-14-13-5-3-12(19)10-11(13)2-4-15(14)16(18)6-7-17(18)20;1-4(2)3/h3-5,10,14,16H,2,6-9H2,1H3;1H
charge 0 multiplicity 1
44 atoms
S  -5.87166 0.504647 0.869689
O  5.982881 1.632293 0.323626
O  -4.700088 -0.449971 -0.636673
O  -7.306407 0.246584 -0.244638
O  -6.208545 -0.260895 2.248398
O  -5.466899 2.070362 0.920118
C  3.703469 0.618878 0.415112
C  3.290868 -0.569774 -0.524147
C  2.919464 1.885086 0.012314
C  0.967807 0.354054 -0.776683
C  1.814558 -0.856986 -0.384431
C  4.380671 -1.641158 -0.277754
C  1.390732 1.619252 0.067013
C  5.228834 0.639177 0.197903
C  5.680073 -0.785858 -0.205169
C  3.501104 0.290009 1.927581
C  -0.532827 0.109258 -0.713182
C  1.283356 -2.012651 0.087008
C  -0.196327 -2.248416 0.283111
C  -1.083119 -1.105942 -0.194612
C  -1.413616 1.125573 -1.192603
C  -2.48171 -1.254853 -0.137414
C  -2.80348 0.975988 -1.1520
C  -3.35573 -0.237607 -0.626324
H  3.450292 -0.190164 -1.561719
H  3.208123 2.182013 -1.016419
H  3.179135 2.732816 0.672669
H  1.220943 0.609819 -1.832424
H  4.417457 -2.395694 -1.082019
H  4.208376 -2.177279 0.673171
H  1.061351 1.472498 1.112697
H  0.851899 2.507963 -0.310878
H  6.177766 -0.715573 -1.19184
H  6.440107 -1.164965 0.501103
H  4.132404 -0.55252 2.262303
H  3.771021 1.172151 2.534599
H  2.452621 0.018869 2.137955
H  1.947899 -2.843282 0.358421
H  -0.40056 -2.446287 1.357462
H  -0.496241 -3.181061 -0.238794
H  -0.985382 2.045985 -1.605061
H  -2.934061 -2.169448 0.263384
H  -3.481251 1.757223 -1.509131
H  -6.888706 -0.039615 -1.111324
