program: Gaussian 09
title: 000168671
version: EM64L-G09RevD.01
frameworkgroup: C1[X(C7H12O3)]
method: RPBEPBE
basis: SDD
operation: Freq
keyword: #pfreq=noraman
keyword: PBEPBE/SDD
title: #p freq=noraman PBEPBE/SDD
converged: YES YES NO NO
title: Mulliken charges:
elementType: O O O C C C C C C C H H H H H H H H H H H H
charge: -0.269747 -0.254976 -0.252817 -0.245450 -0.266436 -0.307436 0.296797 -0.055261 -0.749964 -0.558229 0.186536 0.201914 0.217871 0.250097 0.204374 0.188884 0.234267 0.252315 0.245801 0.243559 0.220810 0.217091
chargesum: 0.00000
title: Mulliken charges with hydrogens summed into heavy atoms:
elementType: O O O C C C C C C C
charge: -0.269747 -0.254976 -0.252817 0.143000 0.201532 0.085822 0.296797 0.179006 -0.008289 -0.120328
polarizability: 1.05970488e+02 -1.03530063e+01 8.52075592e+01 4.51599968e+00 -4.33200319e+00 6.91989369e+01
1716.lowfreq: -6.9751 -1.9009 -0.0006 -0.0005 0.0007 10.6819 17.9292 35.4082 41.1125
frequency: 17.5974 35.3102 41.0751 53.8167 90.9459 118.3277 144.4008 183.9696 200.1131 269.1041 354.8736 401.9066 413.8004 491.5496 565.3285 612.0586 623.9121 789.3687 831.1637 912.9615 925.9745 951.2510 968.6840 991.4159 994.7748 1009.5177 1031.6508 1043.9150 1063.9571 1109.7489 1150.6517 1199.6303 1206.2159 1211.7749 1249.2389 1280.2432 1327.0658 1357.1799 1383.8080 1399.3207 1435.7423 1451.7840 1453.7215 1456.0358 1459.2124 1474.7671 1648.0246 1666.4426 2896.2085 2922.9993 2970.6705 2980.5582 3006.7078 3018.5935 3087.5086 3090.7392 3099.8067 3119.9071 3140.5291 3200.4601
redmass: 3.8534 2.3082 1.5441 1.9889 3.1998 3.8500 3.3176 3.8168 3.0275 2.5184 2.5297 3.1163 2.6002 2.5840 3.0736 3.9111 1.5994 3.2238 2.6610 3.1192 1.7969 1.3534 1.8022 2.3352 2.1485 1.2389 2.4360 1.6665 3.2756 2.4574 1.6657 1.1096 3.5523 1.2466 1.1098 1.2398 1.2148 1.3589 1.2483 1.4663 1.2321 1.0696 1.0652 1.0588 1.0979 1.0809 9.5296 4.8275 1.0615 1.0588 1.0972 1.1006 1.0380 1.0601 1.1058 1.0605 1.0946 1.0945 1.1022 1.1142
irintensity: 1.0125 0.7288 0.7009 1.4215 0.8306 10.1023 2.5685 6.3179 5.5542 4.0354 7.1070 1.5173 0.4290 11.6733 3.2689 1.3980 7.7340 10.7221 12.1084 14.3408 11.5947 109.9177 5.8232 98.5637 13.3831 54.2187 40.2092 11.9988 89.6207 16.9118 4.0938 8.5051 352.1673 3.8093 5.7194 0.1555 34.5796 0.5556 49.7324 3.9676 19.0015 7.2571 33.8080 16.0608 7.2602 6.9094 211.5671 3.8300 56.9452 83.6627 56.5518 32.8906 1.9702 31.4490 20.6969 10.8342 9.8339 8.1834 10.3217 27.0070
temp: 298.150 k
press: 1.00000 atm
elementType: 8 8 8 6 6 6 6 6 6 6 1 1 1 1 1 1 1 1 1 1 1 1
symmnumber: 1
zpe: 470060.8 jmol-1
zpe.correction: 0.179037 hartree
zpe.thermalcorrener: 0.191439 hartree
zpe.thermalcorrenthalpy: 0.192384 hartree
zpe.thermalcorrgfe: 0.137106 hartree
zpe.sumelectzpe: -498.767717 hartree
zpe.sumelectthermal: -498.755315 hartree
zpe.sumelectthermalent: -498.754370 hartree
zpe.sumelectthermalfe: -498.809648 hartree
dipole: -2.0298 -0.2947 -2.3401
dipole: 3.1117
quadrupole: -63.1207 -54.1668 -59.9029
quadrupole: 5.3727 -4.7703 1.3792
quadrupole: -4.0573 4.8967 -0.8394 5.3727 -4.7703 1.3792
hfenergy: -498.9467541 hartree
pointgroup: C01 [X(C7H12O3)]
dipole: 0.7906404 0.1813925 -0.9169288 debye
dipolederiv: -1.1576814 0.2573029 -0.0202112 0.2390354 -0.5044044 -0.0043832 -0.0625795 0.0388165 -0.3918515 -1.3337435 -0.4755153 0.2542629 -0.5705484 -0.7005122 0.0239022 0.2788798 0.0065184 -0.4243624 -0.7982188 -0.0834695 0.1862223 0.1607381 -0.5792972 -0.2677205 0.4163148 -0.1090901 -0.6121326 0.5762211 -0.169887 0.1123871 -0.3019079 0.5215684 -0.0147286 0.3112663 -0.046723 0.3365257 0.468153 0.1953358 0.0278511 0.367884 0.5184919 -0.042319 0.1507055 0.0313725 0.2449691 0.9238636 -0.0990509 -0.0692482 0.0811302 0.3795504 0.0917356 -0.1842741 0.0735242 0.2961312 1.6054033 0.4781436 -0.4487973 0.294413 0.9665378 0.3441847 -0.7355938 0.1531013 0.6933217 -0.1251813 -0.1458224 0.0322767 -0.1559543 -0.0275469 0.0197553 0.0962994 0.0063846 0.1390959 -0.0576851 -0.0696988 0.002357 -0.1531549 -0.3649895 -0.1369077 -0.0027289 -0.0978404 -0.0179642 -0.300748 -0.1091641 0.0721098 -0.1414617 -0.2430804 0.0267524 0.0523024 0.0220215 0.0935534 -0.067421 -0.0987412 -0.0118724 0.024626 -0.234571 0.0090796 -0.0637016 -0.0229109 0.0571926 0.0041595 0.0313696 0.0011146 0.0806418 0.0302491 -0.063333 -0.0881644 0.0257201 -0.1824912 -0.0727822 0.0863026 -0.0351249 -0.0220989 -0.1011002 0.0311321 -0.0727364 0.0302591 0.0700544 0.0701362 -0.0328543 -0.0043145 -0.0942325 0.0210534 0.037943 -0.0512006 -0.0306495 -0.0711108 -0.0464755 0.0204857 -0.0122011 0.0095108 0.031071 -0.095141 0.0564973 -0.063165 -0.1768615 -0.1088089 0.0302858 0.0091887 -0.1011595 -0.2223454 0.0369559 0.0235651 0.003646 0.0545157 0.1404614 0.0349462 0.0114194 0.0721755 0.0824158 -0.0483315 -0.0388986 -0.0186891 -0.1015314 0.0757007 0.0578574 -0.0671536 0.0386741 0.0116809 0.0488159 -0.0598257 0.0697652 0.0608649 0.1032296 -0.0232135 0.0651544 -0.0057455 0.1147489 0.0060076 0.0400609 -0.0382038 -0.073626 -0.0987085 -0.0482152 0.0066363 -0.0131893 0.0969699 -0.0160962 0.0274173 -0.0284615 0.1098145 0.0559969 0.1180307 -0.0842348 0.1364772 0.0792143 0.0461495 -0.0933221 0.0546576 0.0088554 0.1441288 0.0455717 -0.0278224 0.0541468 0.1242954 -0.0334531 -0.0002834 -0.0600538 -0.1129631 unknown
polarizability: 106.3496174|-9.608708|84.2815922|-5.3318658|5.0814735|69.7457746 unknown
InChI: InChI=1S/C7H12O3/c1-3-4-9-5-6-10-7(2)8/h3H,1,4-6H2,2H3
charge 0 multiplicity 1
22 atoms
O  1.287635 0.479325 0.222752
O  -1.59386 -0.049964 -0.417187
O  -3.445203 0.247108 0.96608
C  0.36557 1.37926 -0.47373
C  -1.013615 1.204817 0.136377
C  2.637293 0.50185 -0.368562
C  -2.831522 -0.432641 0.111886
C  3.543424 -0.316769 0.513464
C  -3.272273 -1.757604 -0.470576
C  4.39239 -1.272525 0.063566
H  0.693089 2.436534 -0.345509
H  0.332033 1.152992 -1.561564
H  -1.68103 2.046772 -0.124034
H  -0.954052 1.126415 1.235838
H  2.615708 0.099444 -1.404362
H  2.997628 1.557393 -0.415082
H  3.49198 -0.074962 1.583883
H  -2.782092 -2.579778 0.082193
H  -2.975886 -1.841816 -1.527933
H  -4.361976 -1.865048 -0.364035
H  5.055493 -1.815782 0.745499
H  4.448966 -1.541719 -0.998666
