program: Gaussian 09
title: 000168681
version: EM64L-G09RevD.01
frameworkgroup: C1[X(C12H15NO4)]
method: RPBEPBE
basis: SDD
operation: Freq
keyword: #p
keyword: freq=noraman
keyword: PBEPBE/SDD
title: #p freq=noraman PBEPBE/SDD
converged: YES YES NO NO
title: Mulliken charges:
elementType: O O O O N C C C C C C C C C C C C H H H H H H H H H H H H H H H
charge: -0.427534 -0.207250 -0.251644 -0.249952 -0.439969 -0.410481 0.194994 0.213789 0.237424 0.250079 0.171902 0.057048 0.057230 -0.746350 -0.750436 -0.821889 -0.809133 0.279033 0.295239 0.274757 0.274344 0.186150 0.271674 0.279109 0.186118 0.231059 0.256394 0.277770 0.235966 0.245422 0.260683 0.378454
chargesum: 0.00000
title: Mulliken charges with hydrogens summed into heavy atoms:
elementType: O O O O N C C C C C C C C C C C C
charge: -0.049080 -0.207250 -0.251644 -0.249952 -0.144730 -0.131448 0.194994 0.213789 0.237424 0.250079 0.171902 0.057048 0.057230 -0.011099 -0.013534 -0.056664 -0.067061
polarizability: 1.93824246e+02 1.90303987e+00 1.69870592e+02 1.45400376e+00 1.26403207e+01 1.05821791e+02
1716.lowfreq: -3.5210 0.0003 0.0005 0.0005 4.9633 7.6680 30.1572 45.9390 57.9686
frequency: 30.1010 45.9234 57.9639 71.3673 86.8033 105.4881 111.4320 153.6214 155.3047 161.6936 171.4228 199.0501 216.2239 245.9561 297.3302 304.7450 320.3217 332.1921 340.0982 370.0645 389.6183 412.6706 502.7648 524.5010 542.9732 552.3009 573.4655 582.6152 627.1938 639.3639 655.2833 660.7000 679.4350 688.4013 762.4501 800.1048 867.7415 930.1363 941.4386 980.2509 1011.7360 1015.8598 1018.6068 1026.4236 1029.7025 1037.2699 1040.7032 1064.8266 1123.6078 1147.2337 1229.7487 1235.1826 1276.6652 1296.8175 1309.1261 1325.5629 1342.1417 1371.3650 1373.5199 1403.8069 1409.7060 1431.3460 1433.5437 1443.0064 1451.2849 1459.5592 1462.9205 1465.2540 1467.5380 1469.1194 1530.5142 1542.0000 1619.5622 1633.8203 1661.4769 2976.4101 2978.2300 2985.0014 2985.6604 3059.1673 3065.9406 3082.0915 3082.4108 3082.7423 3099.9687 3100.8653 3121.3932 3121.7582 3497.7644 3536.3442
redmass: 7.8249 5.2895 3.5748 4.8859 3.3033 4.3691 4.8838 1.1927 1.2471 2.4625 1.0663 1.0254 3.7351 3.9881 7.0232 4.8186 3.2498 3.5561 7.2442 6.1293 4.5111 3.5504 3.1077 3.2436 3.7236 3.0607 3.1644 3.0587 2.6566 1.5249 2.1889 2.6340 3.4980 3.3145 5.3244 5.4410 5.8917 2.8939 2.4293 1.5284 1.6446 1.7973 2.0939 1.8140 2.2552 1.6207 1.5936 3.0058 3.4729 3.9022 1.4629 1.8395 4.4532 1.9499 2.2238 3.9638 2.5316 1.2963 1.2593 1.2149 1.1671 1.0548 1.0518 1.1453 1.1818 1.6051 1.1320 1.1159 1.1349 1.2783 3.7720 5.3795 3.9699 7.7920 8.3093 1.0384 1.0386 1.0400 1.0400 1.0965 1.0952 1.0972 1.0972 1.0839 1.0962 1.0962 1.0990 1.0987 1.0640 1.0772
irintensity: 1.7513 4.2743 5.9248 1.1149 0.2713 2.6877 0.5154 2.6884 1.0157 5.6338 0.7938 0.3870 0.0693 6.7125 0.3075 0.6439 3.7353 2.7249 2.5435 7.7208 8.2641 3.8374 3.1222 3.8687 14.0513 8.5640 8.8978 37.3102 43.3694 43.1326 41.1570 45.8334 1.4209 18.8635 4.6318 5.2392 4.0119 40.3286 32.2529 0.2174 28.1332 65.2334 57.4230 51.2287 57.3341 21.5437 5.5216 70.5754 20.8428 4.7812 7.3006 238.1034 51.1388 7.5684 16.5204 56.5133 14.8465 35.6082 78.3882 155.4947 12.7481 18.2948 26.3318 31.4924 18.2728 266.7167 61.4716 27.8415 92.8113 245.9955 194.8012 38.2314 28.2903 183.5308 201.6564 5.1673 6.5211 0.3047 60.0378 14.3663 6.8064 3.1065 27.3788 5.8246 5.3674 7.1088 21.8597 5.6237 20.0962 33.6576
temp: 298.150 k
press: 1.00000 atm
elementType: 8 8 8 8 7 6 6 6 6 6 6 6 6 6 6 6 6 1 1 1 1 1 1 1 1 1 1 1 1 1 1 1
symmnumber: 1
zpe: 658106.5 jmol-1
zpe.correction: 0.250660 hartree
zpe.thermalcorrener: 0.268849 hartree
zpe.thermalcorrenthalpy: 0.269794 hartree
zpe.thermalcorrgfe: 0.204173 hartree
zpe.sumelectzpe: -820.656607 hartree
zpe.sumelectthermal: -820.638417 hartree
zpe.sumelectthermalent: -820.637473 hartree
zpe.sumelectthermalfe: -820.703093 hartree
dipole: -0.4743 0.9421 0.6358
dipole: 1.2316
quadrupole: -127.4101 -77.7300 -101.7931
quadrupole: 2.2665 -2.3977 0.1914
quadrupole: -25.0991 24.5811 0.5180 2.2665 -2.3977 0.1914
hfenergy: -820.9072661 hartree
pointgroup: C01 [X(C12H15N1O4)]
dipole: -0.2040028 -0.2414031 -0.3672591 debye
polarizability: 193.5297623|-3.3964753|152.8642759|-0.7774636|31.2123819|123.1225911 unknown
InChI: InChI=1S/C12H15NO4/c1-5-9(7(3)14)11(12(16)17)10(8(4)15)6(2)13-5/h11,13,16H,1-4H3
charge 0 multiplicity 1
32 atoms
O  -0.527673 2.588011 -0.249231
O  0.493178 1.200901 -1.806847
O  -3.627844 -0.595289 0.837028
O  3.632338 -0.767263 0.997648
N  0.004406 -2.089846 -0.866654
C  0.042789 0.342336 0.500629
C  -1.257837 -0.477326 0.383295
C  1.291619 -0.537897 0.430353
C  -1.231633 -1.616762 -0.41518
C  1.243357 -1.675663 -0.36484
C  0.059285 1.373376 -0.649937
C  -2.501306 -0.032946 1.054479
C  2.542579 -0.107968 1.090161
C  -2.418511 -2.463621 -0.808424
C  2.405545 -2.568606 -0.724655
C  -2.423608 1.121107 2.053334
C  2.519451 1.179995 1.918087
H  0.024541 0.915938 1.438402
H  -0.001757 -2.899857 -1.489419
H  -3.188035 -1.855177 -1.309665
H  -2.918286 -2.878798 0.083557
H  -2.109461 -3.293353 -1.471966
H  2.818605 -3.059174 0.173311
H  3.238139 -1.978713 -1.140019
H  2.099125 -3.342579 -1.453583
H  -1.732314 0.885532 2.885905
H  -3.430269 1.289835 2.465045
H  -2.061176 2.046689 1.570949
H  1.844763 1.081829 2.79061
H  2.170742 2.048667 1.328861
H  3.53952 1.37735 2.28082
H  -0.557772 3.21237 -1.025254
