program: Gaussian 09
title: 000168715
version: EM64L-G09RevD.01
frameworkgroup: C1[X(C20H18O7)]
method: RPBEPBE
basis: SDD
operation: Freq
keyword: #pfreq=noraman
keyword: PBEPBE/SDD
title: #p freq=noraman PBEPBE/SDD
converged: YES YES NO NO
title: Mulliken charges:
elementType: O O O O O O O C C C C C C C C C C C C C C C C C C C C H H H H H H H H H H H H H H H H H H
charge: -0.187991 -0.451084 -0.214784 -0.292065 -0.258629 -0.263893 -0.289612 -0.149124 -0.244899 -0.317858 -0.383942 -0.643297 0.169967 0.537397 0.589120 -0.493348 -0.469397 -0.551156 -0.394001 0.233571 0.204745 -0.334541 0.168441 -0.342592 0.187536 -0.220170 -0.209965 0.274292 0.286775 0.220347 0.223429 0.274949 0.253394 0.218577 0.350432 0.283180 0.246353 0.260728 0.239442 0.254583 0.249949 0.259978 0.239875 0.240641 0.244646
chargesum: 0.00000
title: Mulliken charges with hydrogens summed into heavy atoms:
elementType: O O O O O O O C C C C C C C C C C C C C C C C C C C C
charge: -0.187991 -0.100652 -0.214784 -0.292065 -0.258629 -0.263893 -0.289612 0.125168 0.041876 -0.097511 0.114437 -0.171326 0.169967 0.537397 0.589120 -0.210168 -0.223044 -0.290428 -0.154559 0.233571 0.204745 -0.079958 0.168441 -0.092644 0.187536 0.279682 0.275322
polarizability: 2.95829471e+02 1.61759857e+00 1.63361297e+02 6.79231630e+00 -1.94611163e+01 2.03067925e+02
1716.lowfreq: -5.1485 -0.0008 -0.0007 -0.0005 0.9120 4.5182 33.1628 41.1248 48.1957
frequency: 33.1351 41.0919 48.1928 51.5825 60.2666 65.5183 80.5975 113.3894 119.0378 130.1788 140.4280 152.3168 163.2668 186.0503 209.9434 230.9976 243.9874 274.9050 283.2168 295.4943 322.1418 337.7994 366.0217 391.9725 411.3319 414.6526 428.5364 452.0834 467.8378 488.1126 527.1232 544.7790 581.9879 599.4971 619.8254 624.0007 644.8328 654.6497 674.9333 676.8273 705.4004 718.1943 723.0753 745.2397 766.3941 776.8911 790.3329 810.5759 816.5025 830.1822 835.0210 843.9932 869.8627 878.0950 891.2997 893.3315 908.6237 924.3568 931.7342 936.6450 939.6176 957.0981 972.6531 974.2786 990.4735 1033.3275 1055.6137 1059.5067 1062.3311 1075.0771 1075.3210 1080.6226 1120.3739 1127.6821 1131.3630 1135.3767 1143.8331 1163.7604 1166.6322 1179.2610 1185.0684 1216.7869 1236.3113 1245.7448 1251.1253 1253.8752 1263.9829 1273.5977 1292.0336 1310.7710 1314.3974 1323.5680 1340.0877 1368.0079 1369.5022 1374.4794 1398.9110 1409.2050 1438.9625 1444.8568 1471.3975 1472.2284 1473.3066 1483.0524 1487.5481 1488.8032 1609.5060 1610.5551 1628.8825 1629.2514 1692.2759 2945.2052 2993.1038 3009.9495 3015.1039 3025.8016 3026.7490 3048.0901 3055.8486 3110.5243 3121.0953 3126.2722 3132.0179 3135.0413 3157.5361 3170.4443 3175.8777 3181.7883 3569.6450
redmass: 6.6532 6.1850 6.4568 5.9255 7.3954 5.7756 6.2759 2.9350 3.3926 5.4705 3.8510 5.9965 5.7539 6.5524 5.9165 5.5468 5.9560 3.7657 3.9299 2.6610 6.1624 1.2165 5.2202 5.5433 3.2533 4.3816 3.1250 5.0164 3.8377 5.3946 4.5847 6.4330 5.5575 6.5482 5.7126 5.2878 5.7854 6.8252 9.0721 9.1694 5.6497 4.3962 4.1554 6.1121 6.1458 6.0536 4.9601 1.5635 1.4632 6.4637 8.4783 2.8011 1.7070 2.0524 1.7122 2.1316 3.5836 3.3349 1.7116 1.3973 2.4054 4.4756 4.8262 5.4529 2.7845 3.6759 2.7533 3.5342 2.6023 1.4788 1.4870 2.4562 2.8018 1.4732 1.4358 1.0631 1.0668 1.1102 1.1613 1.7034 1.6133 1.4165 1.8899 1.7350 1.9292 3.1262 1.5191 1.4257 1.3002 1.5723 1.4360 1.2892 1.4169 1.2572 1.2660 1.5125 3.9474 3.0010 3.9522 4.9008 1.6022 1.1585 1.7765 2.2051 1.0885 1.2614 7.8177 7.7276 8.2545 8.2436 12.6103 1.0846 1.0604 1.0595 1.0571 1.0728 1.0776 1.0842 1.1015 1.1153 1.1117 1.1032 1.0901 1.0898 1.0928 1.0931 1.0957 1.0953 1.0662
irintensity: 1.1207 0.6442 0.3221 0.8685 1.8408 1.3557 0.7124 6.1106 25.5340 4.0550 16.7206 0.7141 1.0346 4.4894 0.8511 1.4941 1.5305 5.0175 15.0566 6.8092 1.5133 142.0601 1.7024 5.2867 2.3436 4.1473 13.3051 5.0210 3.3974 2.9936 6.7250 12.4804 2.9384 2.7069 4.3678 10.7187 19.7595 6.6133 0.1753 0.8306 2.4120 4.2421 5.3756 1.8269 11.0569 9.1341 9.5375 44.6911 56.8810 30.9238 27.7992 9.0574 66.8020 28.7745 4.2105 18.5671 4.8007 11.7393 8.6295 4.4142 12.8371 59.8552 10.4854 172.8878 74.1361 8.2376 47.0620 9.4082 9.9309 7.0665 7.7128 63.5613 128.4491 9.8051 11.7660 2.9173 0.5409 8.1816 11.9884 6.9161 41.1357 20.8853 45.2322 34.1140 12.1395 217.4189 25.3855 11.7576 18.2982 29.9162 4.9547 0.4706 1.8023 0.2122 3.0934 11.5155 8.7057 11.1189 24.2752 58.7313 1.8900 22.9525 63.0586 156.5041 8.2437 11.3167 1.7795 9.4851 0.7222 1.0579 320.9621 31.9958 22.0331 64.7040 86.2501 27.5517 6.5514 13.2545 16.4832 28.3830 32.1599 6.5498 6.8968 6.0089 3.4730 0.7893 2.3805 3.3626 7.7571
temp: 298.150 k
press: 1.00000 atm
elementType: 8 8 8 8 8 8 8 6 6 6 6 6 6 6 6 6 6 6 6 6 6 6 6 6 6 6 6 1 1 1 1 1 1 1 1 1 1 1 1 1 1 1 1 1 1
symmnumber: 1
zpe: 900493.0 jmol-1
zpe.correction: 0.342980 hartree
zpe.thermalcorrener: 0.365945 hartree
zpe.thermalcorrenthalpy: 0.366889 hartree
zpe.thermalcorrgfe: 0.290173 hartree
zpe.sumelectzpe: -1297.491799 hartree
zpe.sumelectthermal: -1297.468834 hartree
zpe.sumelectthermalent: -1297.467890 hartree
zpe.sumelectthermalfe: -1297.544606 hartree
dipole: 5.2267 1.7317 2.0091
dipole: 5.8612
quadrupole: -173.0328 -152.3606 -158.4825
quadrupole: -4.3267 -7.6569 -3.3916
quadrupole: -11.7408 8.9313 2.8095 -4.3267 -7.6569 -3.3916
hfenergy: -1297.834779 hartree
pointgroup: C01 [X(C20H18O7)]
dipole: -1.9755796 0.9539212 -0.7103498 debye
polarizability: 294.0733622|-16.0410552|162.4487323|7.2570338|15.4483806|205.7365982 unknown
InChI: InChI=1S/C20H18O7/c21-19(12-2-4-16-18(7-12)27-10-25-16)14-8-23-20(22)13(14)5-11-1-3-15-17(6-11)26-9-24-15/h1-4,6-7,13-14,19,21H,5,8-10H2
charge 0 multiplicity 1
45 atoms
O  4.74982 -0.841685 -0.462524
O  2.377234 1.784571 -2.294867
O  4.528669 -1.431634 1.773679
O  -2.779537 1.656792 -0.838426
O  -2.820217 2.679762 1.33303
O  -2.753558 -2.158283 -1.846265
O  -3.894823 -1.351649 0.10242
C  2.453452 -0.211514 -0.977529
C  2.49884 -0.893767 0.412936
C  2.271331 1.326259 -0.890701
C  3.821087 -0.583703 -1.607164
C  1.74749 -2.265797 0.502558
C  3.997176 -1.091926 0.703341
C  0.944214 1.738592 -0.268844
C  0.237843 -2.083832 0.452468
C  -0.26867 1.46972 -0.974169
C  0.910613 2.363233 1.001091
C  -0.476452 -2.296966 -0.764428
C  -0.455227 -1.638855 1.607638
C  -1.459775 1.814845 -0.342075
C  -1.843304 -2.012989 -0.768382
C  -0.315302 2.717699 1.631062
C  -1.487369 2.419505 0.935143
C  -1.849989 -1.366369 1.59515
C  -2.514512 -1.547727 0.380901
C  -3.672757 2.043237 0.291827
C  -4.004688 -1.50783 -1.376948
H  1.626796 -0.600273 -1.596679
H  2.083476 -0.241559 1.202281
H  3.103754 1.760255 -0.29272
H  3.77289 -1.50922 -2.20736
H  4.252441 0.229808 -2.207032
H  2.049396 -2.743986 1.453123
H  2.089254 -2.925219 -0.317864
H  2.157446 2.749646 -2.330623
H  -0.25363 1.007123 -1.96451
H  1.852244 2.5803 1.51898
H  0.025402 -2.66964 -1.662526
H  0.102383 -1.492485 2.539968
H  -0.341147 3.199358 2.611442
H  -2.375681 -1.02749 2.491612
H  -4.1343 1.127766 0.703956
H  -4.403512 2.783645 -0.068748
H  -4.856617 -2.165702 -1.603448
H  -4.077487 -0.504115 -1.835176
