program: Gaussian 09
title: 000168674
version: EM64L-G09RevD.01
frameworkgroup: C1[X(C16H16N2O4S)]
method: RPBEPBE
basis: SDD
operation: Freq
keyword: #p
keyword: freq=noraman
keyword: PBEPBE/SDD
title: #p freq=noraman PBEPBE/SDD
converged: YES YES NO NO
title: Mulliken charges:
elementType: S O O O O N N C C C C C C C C C C C C C C C C H H H H H H H H H H H H H H H H
charge: 0.211003 -0.153071 -0.423891 -0.271178 -0.211728 -0.174289 -0.373954 -0.484102 -0.181002 0.103318 0.188202 -0.795549 0.345623 0.238196 -0.771318 0.108022 -0.659011 0.397774 -0.381482 -0.383290 -0.221659 -0.219791 -0.237182 0.324121 0.311347 0.353850 0.274512 0.282730 0.265486 0.247505 0.220006 0.251967 0.254193 0.388016 0.246636 0.237994 0.232242 0.228689 0.231066
chargesum: 0.00000
title: Mulliken charges with hydrogens summed into heavy atoms:
elementType: S O O O O N N C C C C C C C C C C C C C C C C
charge: 0.211003 -0.153071 -0.035876 -0.271178 -0.211728 -0.174289 -0.020104 -0.159981 0.130344 0.103318 0.188202 -0.238307 0.345623 0.238196 -0.038321 0.108022 -0.152850 0.397774 -0.134846 -0.145295 0.010583 0.008899 -0.006117
polarizability: 2.16102806e+02 1.61996546e+01 2.29971060e+02 1.03811597e+01 -1.12207942e+01 1.90010540e+02
1716.lowfreq: -6.8991 0.0007 0.0009 0.0012 1.9750 6.5579 14.0359 19.2340 24.3228
frequency: 9.2388 18.9829 24.2990 38.9497 45.8407 52.6956 69.5950 74.1253 103.5945 115.6562 127.9794 144.1260 171.4703 200.1374 234.9385 247.8822 281.4404 299.8212 309.6357 317.0655 346.6875 371.9383 388.1121 402.1381 431.0040 463.1118 478.4157 494.3473 539.4976 540.0677 570.8127 592.9129 610.3192 617.4224 624.8190 634.7560 648.7535 680.6967 704.9197 709.1927 725.0014 737.1342 761.9590 786.8493 830.5919 845.5278 857.8184 876.6135 914.3133 916.9890 930.9301 939.1725 961.5535 980.3189 989.7916 994.4246 998.8154 1025.0387 1027.1154 1028.0095 1082.3993 1097.5573 1106.1895 1157.2975 1167.0748 1173.3287 1180.6591 1183.0655 1189.7766 1198.4370 1212.7013 1223.8482 1230.6958 1248.9078 1260.6319 1290.2833 1300.3529 1326.4913 1327.9937 1379.8189 1380.6512 1402.8556 1419.6759 1439.6276 1444.5762 1460.8217 1461.7774 1480.5049 1485.0569 1591.0699 1609.8473 1617.5976 1624.9273 1646.4144 1736.2443 2974.3119 2994.9528 3006.5187 3043.9400 3046.1650 3061.6966 3062.0885 3079.9548 3121.7612 3122.5293 3133.8375 3136.7691 3149.1592 3166.1871 3510.3716 3516.7731
redmass: 4.4452 4.4958 6.3428 8.7007 5.0043 6.1414 5.2133 7.8828 1.7107 5.3243 3.0300 4.6290 3.3281 7.9195 4.6609 6.2942 6.8752 3.9804 2.9856 3.1835 3.5660 6.9429 6.6482 2.8187 4.2857 4.0742 4.8894 5.8158 3.1831 3.7935 4.2411 4.7763 3.9458 6.2947 1.5836 1.2869 3.7655 5.5497 2.4101 2.8675 5.6711 6.8594 2.0349 7.8687 3.6366 1.7392 1.2490 5.2578 2.1412 2.4413 1.7814 3.3744 4.0535 1.3879 6.2678 3.7964 1.3195 1.4594 2.2564 2.8139 1.5977 3.2340 1.9543 1.8785 2.4022 1.0811 1.1691 1.2036 1.1255 1.7359 2.1387 1.5450 2.1212 1.5622 1.5487 1.5558 2.1315 1.9407 1.2799 5.0477 8.0435 1.2173 1.0959 2.1229 1.1277 1.0899 1.0576 1.9442 2.2828 5.9959 6.7169 6.8863 7.7169 8.0981 12.7953 1.0406 1.0606 1.0615 1.0972 1.0837 1.1002 1.0992 1.0897 1.0860 1.0885 1.0951 1.0913 1.0960 1.1016 1.0639 1.0778
irintensity: 0.4330 0.3152 0.4437 2.6257 2.7788 2.2816 1.2721 2.6176 1.2467 2.5520 0.8077 1.2821 0.9467 2.4097 9.5584 3.7055 2.6595 4.3705 1.2149 2.2910 3.4020 34.0474 1.9254 0.0596 1.9526 11.4712 2.4538 16.3630 8.5567 44.9328 6.0394 0.4513 2.7259 0.1543 85.7689 70.3517 53.5814 7.2421 50.2864 11.4207 11.8613 13.6142 33.6691 16.4940 3.4107 1.3091 0.1484 29.9884 4.2236 2.1100 14.6641 41.5345 33.0584 0.0442 0.2268 33.2837 0.6694 9.5116 16.6361 73.4382 8.3802 180.4050 90.8357 20.8421 11.4514 0.0440 4.4616 7.2401 0.7965 2.2680 14.0046 10.9232 73.9518 5.6501 7.4206 49.5350 186.7109 21.1668 0.5447 55.1374 0.3367 20.6957 17.9623 9.8543 55.0750 10.8875 17.1515 311.9326 42.7709 1.4795 183.9600 126.6123 81.7111 175.2543 431.4487 19.9272 29.5139 11.1648 17.3167 34.2518 3.5636 2.9004 14.3462 5.8198 1.8348 5.5378 9.6155 31.1845 17.9057 43.8506 53.4255
temp: 298.150 k
press: 1.00000 atm
elementType: 16 8 8 8 8 7 7 6 6 6 6 6 6 6 6 6 6 6 6 6 6 6 6 1 1 1 1 1 1 1 1 1 1 1 1 1 1 1 1
symmnumber: 1
zpe: 772378.1 jmol-1
zpe.correction: 0.294183 hartree
zpe.thermalcorrener: 0.316108 hartree
zpe.thermalcorrenthalpy: 0.317052 hartree
zpe.thermalcorrgfe: 0.238635 hartree
zpe.sumelectzpe: -1426.093110 hartree
zpe.sumelectthermal: -1426.071185 hartree
zpe.sumelectthermalent: -1426.070241 hartree
zpe.sumelectthermalfe: -1426.148658 hartree
dipole: 1.7397 6.4745 -1.1934
dipole: 6.8095
quadrupole: -122.7469 -149.0629 -138.5901
quadrupole: 5.4294 -7.8032 -1.6328
quadrupole: 14.0531 -12.2630 -1.7901 5.4294 -7.8032 -1.6328
hfenergy: -1426.3872931 hartree
pointgroup: C01 [X(C16H16N2O4S1)]
dipole: -0.3232161 2.4610346 1.0080689 debye
polarizability: 211.4947409|-16.0020076|228.3734283|8.9918428|17.66676|196.2162369 unknown
InChI: InChI=1S/C16H16N2O4S/c1-9-8-23-15-12(14(20)18(15)13(9)16(21)22)17-11(19)7-10-5-3-2-4-6-10/h2-6,12,15,17,21H,7-8H2,1H3
charge 0 multiplicity 1
39 atoms
S  -0.343678 0.924875 1.701017
O  -1.223068 -1.011136 -2.252893
O  -4.631065 1.571558 -1.678461
O  1.730125 -3.42587 0.738283
O  -4.365639 -0.73369 -1.625422
N  -2.057132 -0.377739 -0.041306
N  1.124816 -1.300836 0.008399
C  -1.169048 -0.67178 1.096527
C  -0.288794 -1.552907 0.128085
C  -1.215871 -1.00035 -1.014394
C  -3.049726 0.630805 -0.097401
C  -2.019859 1.790277 1.931668
C  -3.067151 1.648386 0.832295
C  2.061847 -2.283253 0.306071
C  -4.145166 2.708936 0.933125
C  -4.057296 0.392453 -1.176867
C  3.541003 -1.914224 0.065754
C  3.831184 -0.480844 -0.346869
C  3.769467 -0.091903 -1.711711
C  4.149232 0.503612 0.625369
C  4.018927 1.245424 -2.094907
C  4.400587 1.841305 0.24539
C  4.33561 2.216597 -1.116665
H  -1.656332 -1.172899 1.945779
H  -0.421094 -2.632199 0.321145
H  1.451105 -0.392761 -0.333423
H  -1.765494 2.85875 2.0522
H  -2.442935 1.445719 2.894587
H  -5.064434 2.437388 0.397311
H  -3.784052 3.661717 0.498717
H  -4.387368 2.905898 1.995304
H  4.07055 -2.176292 0.999504
H  3.902314 -2.627015 -0.699456
H  -5.268234 1.319849 -2.401618
H  3.529722 -0.841041 -2.476409
H  4.202918 0.218471 1.683225
H  3.968652 1.527242 -3.152435
H  4.64819 2.587341 1.008745
H  4.532086 3.252934 -1.412861
