program: Gaussian 09
title: 000168447
version: EM64L-G09RevD.01
frameworkgroup: C1[X(C7H12O2)]
method: RPBEPBE
basis: SDD
operation: Freq
keyword: #pfreq=noraman
keyword: PBEPBE/SDD
title: #p freq=noraman PBEPBE/SDD
converged: YES YES NO NO
title: Mulliken charges:
elementType: O O C C C C C C C H H H H H H H H H H H H
charge: -0.431324 -0.246310 -0.369020 -0.487868 -0.340920 0.416490 -0.695022 0.072656 -0.668971 0.224053 0.200894 0.199923 0.221534 0.198729 0.193874 0.216424 0.210972 0.212470 0.233214 0.257840 0.380362
chargesum: 0.00000
title: Mulliken charges with hydrogens summed into heavy atoms:
elementType: O O C C C C C C C
charge: -0.050962 -0.246310 0.055927 -0.066411 0.051683 0.416490 -0.055156 0.072656 -0.177917
polarizability: 9.59679238e+01 5.86102958e+00 9.11817197e+01 -7.67182806e+00 -3.65714727e+00 6.04725654e+01
1716.lowfreq: -14.1658 -4.6951 -0.0010 -0.0007 -0.0005 12.3530 54.1410 57.8024 68.4321
frequency: 54.1358 57.6419 68.3950 118.7735 133.2989 229.0803 243.5582 288.3193 345.1403 374.7151 440.5562 495.6260 556.0586 627.6796 675.1044 729.4737 741.9452 786.1013 796.4431 896.9976 924.5057 941.7891 996.5087 1021.4224 1047.6881 1070.1409 1088.7162 1107.1430 1202.6119 1229.9848 1256.6673 1280.4813 1291.3057 1319.0379 1332.7195 1347.9997 1390.8482 1414.6679 1462.0170 1467.8710 1477.5601 1478.3171 1487.7059 1625.2332 1651.2546 2964.9187 2973.3621 2979.7323 2990.8260 3009.7309 3036.2481 3060.3313 3071.8963 3072.4507 3102.3604 3214.1661 3519.5680
redmass: 7.5113 4.0915 1.6502 2.8064 2.6246 1.5552 1.7113 3.7240 3.1361 2.9309 2.7114 3.7585 3.5821 1.3666 1.5626 1.3116 2.0847 2.3786 1.2590 1.7915 1.2413 2.0142 1.3814 3.2653 2.6185 2.5662 1.4355 2.1304 1.6776 1.5890 1.3067 1.2224 1.0667 1.3894 2.8345 1.5835 1.2133 1.1771 1.0994 1.0679 1.0687 1.0442 1.0817 7.3489 5.9578 1.0585 1.0370 1.0602 1.0607 1.0976 1.1004 1.1038 1.0999 1.1009 1.0616 1.1156 1.0640
irintensity: 1.6622 0.1877 0.0533 0.6654 0.1583 0.0794 0.1217 1.7009 1.3061 4.6560 16.5111 21.7116 13.3533 92.9104 46.6888 16.5977 0.2174 12.4000 0.4281 5.9900 9.7733 2.5145 62.4986 2.8322 297.0626 1.7130 6.5749 14.9272 5.3487 2.5601 4.6726 4.5043 3.5406 4.3237 56.4913 1.6991 12.2900 24.4879 9.2308 0.2501 5.8146 11.6191 17.3349 170.4260 41.6262 27.0854 30.0072 19.3348 55.5251 10.3124 1.6158 10.3852 65.3782 91.8910 4.6327 4.5416 32.4281
temp: 298.150 k
press: 1.00000 atm
elementType: 8 8 6 6 6 6 6 6 6 1 1 1 1 1 1 1 1 1 1 1 1
symmnumber: 1
zpe: 463964.6 jmol-1
zpe.correction: 0.176715 hartree
zpe.thermalcorrener: 0.187300 hartree
zpe.thermalcorrenthalpy: 0.188244 hartree
zpe.thermalcorrgfe: 0.139790 hartree
zpe.sumelectzpe: -423.661872 hartree
zpe.sumelectthermal: -423.651288 hartree
zpe.sumelectthermalent: -423.650343 hartree
zpe.sumelectthermalfe: -423.698797 hartree
dipole: -1.7821 0.2873 0.7287
dipole: 1.9466
quadrupole: -63.4958 -47.1490 -57.1785
quadrupole: -0.4610 2.3639 -0.9842
quadrupole: -7.5547 8.7921 -1.2374 -0.4610 2.3639 -0.9842
hfenergy: -423.8385871 hartree
pointgroup: C01 [X(C7H12O2)]
dipole: -0.7013228 0.0620353 0.3014077 debye
dipolederiv: -0.4821318 -0.295817 0.041332 -0.3908851 -1.0374849 0.257237 0.0245641 0.2164797 -0.4313122 -0.9343257 0.0817132 0.2696626 0.1749997 -0.6038794 -0.0487006 0.2949707 -0.0175188 -0.4590129 0.0130225 -0.0256777 0.016147 0.011869 0.1616618 -0.0334729 0.1279715 0.0080736 0.0577207 -0.1573824 -0.1058258 0.0052673 -0.0972774 0.0745297 0.0055853 -0.028744 -0.0177343 0.1089677 0.0621796 -0.0282131 -0.0154224 -0.0436117 0.1659026 -0.0154491 -0.0956692 -0.0423744 0.1007144 0.2787374 0.1536232 -0.0892673 0.141485 -0.4189742 -0.0437931 -0.1822436 -0.0713069 -0.0235213 -0.065384 -0.0480074 -0.0519463 -0.034566 0.0790117 -0.0252694 -0.0050703 -0.011269 0.0383352 1.0660057 -0.060907 -0.3988447 0.073043 1.5775468 -0.146771 -0.4138755 -0.0523688 0.4303001 -0.1777904 0.0085712 -0.1186364 -0.1497123 0.0423098 0.0395212 -0.0671361 -0.0226111 -0.2699515 0.0618324 0.0453209 0.0291027 0.0389648 -0.0821767 -0.1022418 0.045272 -0.0720607 0.0136125 0.0246494 -0.0114843 -0.0118534 0.0024464 -0.0302971 0.1308904 -0.0181702 0.0979438 -0.085945 0.0093979 0.0429062 0.0353935 0.065088 -0.1117605 -0.1172265 0.0197264 -0.0538734 0.0282975 0.0614511 -0.0181854 0.0076483 0.0011988 0.0240858 0.1216217 -0.0028365 0.0879293 -0.0392479 0.0327584 0.0171447 -0.0435948 -0.0066763 -0.0287522 0.1390879 -0.0097409 0.1170985 -0.1056227 0.011688 0.0214903 0.0166313 0.0630071 -0.1347679 -0.1324253 0.0335878 -0.0989477 0.0049116 -0.205819 -0.0502472 0.0698977 -0.0434301 0.0909366 0.0009248 0.0946858 0.0055485 0.0385162 0.0892134 -0.0116114 -0.0077333 0.0233078 -0.0343295 0.1444441 -0.0576084 0.1085081 -0.0766402 0.0721176 0.0870916 0.027677 0.0332484 -0.1193189 -0.1106682 -0.0103302 -0.0934501 0.0296513 0.060973 0.0989429 0.051773 0.0733117 -0.0151355 -0.0279381 0.0423196 -0.0385759 0.1398434 0.0019228 -0.0172056 0.0827694 -0.0047556 0.1103237 -0.0036846 0.1026006 0.0142603 0.1593912 0.1768838 0.1163781 0.0839968 0.0689448 0.2905684 -0.0316716 0.1057262 -0.0637507 0.340992 unknown
polarizability: 95.5032917|6.7547878|91.9855704|-7.2087269|-0.5555012|60.1333468 unknown
InChI: InChI=1S/C7H12O2/c1-3-4-5-6(2)7(8)9/h8H,2-5H2,1H3
charge 0 multiplicity 1
21 atoms
O  1.15706 -1.687661 0.261887
O  2.92055 -0.537274 -0.708814
C  -1.453344 0.109168 -0.246691
C  -0.388477 0.564742 0.789823
C  -2.856045 -0.04149 0.384354
C  1.00053 0.718525 0.195886
C  -3.92334 -0.490958 -0.6364
C  1.800409 -0.502574 -0.144382
C  1.583548 1.922948 -0.063373
H  -1.142445 -0.857935 -0.685471
H  -1.494474 0.84392 -1.075895
H  -0.700747 1.533849 1.224715
H  -0.363158 -0.175268 1.612013
H  -2.802811 -0.775497 1.213983
H  -3.160593 0.923298 0.839602
H  -4.917073 -0.594702 -0.163151
H  -4.016804 0.23988 -1.461788
H  -3.657657 -1.467691 -1.082689
H  1.069876 2.862645 0.167496
H  2.582885 1.977809 -0.508949
H  1.739007 -2.459236 0.024045
