program: Gaussian 09
title: 000168479
version: EM64L-G09RevD.01
frameworkgroup: C1[X(C8H15NO4S)]
method: RPBEPBE
basis: SDD
operation: Freq
keyword: #p
keyword: freq=noraman
keyword: PBEPBE/SDD
title: #p freq=noraman PBEPBE/SDD
converged: YES YES NO NO
title: Mulliken charges:
elementType: S O O O O N C C C C C C C C H H H H H H H H H H H H H H H
charge: 0.626735 -0.633622 -0.404143 -0.233104 -0.283446 -0.395739 -0.401977 -0.141729 -0.674749 -0.572857 0.154378 0.246170 -0.650179 -0.775036 0.308700 0.251980 0.297725 0.316474 0.269451 0.335511 0.248416 0.277911 0.265902 0.223865 0.221222 0.251529 0.258105 0.222278 0.390229
chargesum: 0.00000
title: Mulliken charges with hydrogens summed into heavy atoms:
elementType: S O O O O N C C C C C C C C
charge: 0.626735 -0.633622 -0.013914 -0.233104 -0.283446 -0.060228 0.158703 0.155996 -0.088824 -0.046530 0.154378 0.246170 0.060810 -0.043124
polarizability: 1.34575571e+02 -1.55079536e+01 1.31137201e+02 3.62243794e+00 -2.12103054e+00 1.16814235e+02
1716.lowfreq: -8.7900 -3.7929 0.0006 0.0025 0.0026 9.3895 24.4323 42.2591 47.4543
frequency: 24.2135 42.1804 47.4417 65.3147 69.3017 80.3340 88.5897 100.5578 131.5715 156.5151 184.8560 217.9599 254.9596 265.2786 274.2387 298.2018 343.9843 352.3981 406.0851 442.7820 477.5183 515.1449 521.4944 569.1578 590.1263 600.8820 611.1483 627.4713 695.9612 772.1800 785.3846 799.0253 871.3856 918.5378 966.0147 980.0929 989.8441 1016.0777 1032.9340 1040.5392 1058.8130 1063.3527 1076.1158 1116.2060 1157.9154 1184.2083 1233.4262 1237.2435 1252.2371 1263.0359 1281.3324 1322.7072 1344.4414 1365.5906 1389.5187 1391.4565 1424.8852 1449.9909 1450.9989 1465.6921 1467.3654 1477.6008 1485.6223 1492.4585 1605.2333 1653.9086 2829.7620 2983.5870 2998.3903 3023.1318 3026.8731 3045.0272 3062.1915 3078.3745 3086.1361 3095.1025 3106.9249 3120.3583 3131.4069 3514.0751 3516.2187
redmass: 4.7566 4.1470 6.4946 6.7818 4.5270 2.4759 1.5015 2.0648 4.6064 5.2010 3.1432 1.2603 3.5342 3.1783 3.5358 5.4921 4.0880 3.6560 3.0705 4.8786 4.0338 4.0792 4.0876 2.4562 2.6433 1.8298 2.6929 1.5129 3.7698 2.2156 1.7731 1.7966 4.3008 1.7935 3.5932 1.4783 1.6134 3.5760 1.3389 1.6490 2.6225 2.5026 2.2539 1.8700 1.5690 1.3112 1.3180 1.2600 1.2975 1.6786 1.3031 1.4033 1.9077 1.2720 1.2279 1.1937 1.1030 1.0588 1.1090 1.0502 1.0961 1.1317 1.0502 1.7416 6.0334 8.5009 1.0739 1.0353 1.0361 1.0831 1.0571 1.0585 1.0866 1.0988 1.1007 1.0983 1.1006 1.1080 1.1094 1.0759 1.0659
irintensity: 2.0437 0.3453 13.5091 7.6021 0.9104 3.0602 2.0704 0.6648 0.8234 10.5668 6.1856 1.8467 11.9274 2.0822 10.6766 5.5545 3.3900 0.2797 15.5706 5.1272 16.7605 29.0442 2.4499 11.3990 10.0260 142.4034 27.4161 92.9583 43.9814 15.4892 18.9096 17.5563 2.5692 4.0213 14.0250 16.2616 17.0262 6.5963 0.4219 19.9883 113.6175 96.1726 34.6541 7.3656 5.8648 3.0774 10.1565 1.4207 21.1764 11.8088 19.1528 35.7601 110.0647 9.7562 64.4439 32.0636 2.5263 27.5673 17.0008 3.7168 64.0942 75.5648 10.7395 113.1770 180.3678 172.2741 45.1466 28.2529 6.6152 10.2870 8.0200 13.4248 14.3235 15.2961 5.8818 10.3372 13.9026 15.3669 5.4003 65.5157 19.5497
temp: 298.150 k
press: 1.00000 atm
elementType: 16 8 8 8 8 7 6 6 6 6 6 6 6 6 1 1 1 1 1 1 1 1 1 1 1 1 1 1 1
symmnumber: 1
zpe: 601462.0 jmol-1
zpe.correction: 0.229085 hartree
zpe.thermalcorrener: 0.246374 hartree
zpe.thermalcorrenthalpy: 0.247318 hartree
zpe.thermalcorrgfe: 0.182005 hartree
zpe.sumelectzpe: -1066.387969 hartree
zpe.sumelectthermal: -1066.370680 hartree
zpe.sumelectthermalent: -1066.369736 hartree
zpe.sumelectthermalfe: -1066.435048 hartree
dipole: 0.4084 1.5751 0.4501
dipole: 1.6883
quadrupole: -82.1279 -92.4387 -100.0544
quadrupole: -13.1863 -3.9972 -12.6694
quadrupole: 9.4124 -0.8983 -8.5141 -13.1863 -3.9972 -12.6694
hfenergy: -1066.6170537 hartree
pointgroup: C01 [X(C8H15N1O4S1)]
dipole: 0.349432 0.5565563 0.0966573 debye
polarizability: 126.4896633|-14.1118664|139.5566115|2.5241915|-2.7270743|116.4807329 unknown
InChI: InChI=1S/C8H15NO4S/c1-3-14(13)5-4-7(8(11)12)9-6(2)10/h7,9,11H,3-5H2,1-2H3
charge 0 multiplicity 1
29 atoms
S  -2.947512 -0.550277 0.934626
O  -2.820971 -1.426476 -0.496917
O  2.374866 -2.717146 0.119002
O  2.145343 -1.425838 -1.798568
O  1.047756 1.92897 1.433033
N  0.833416 0.552446 -0.429315
C  -0.227459 -1.442935 0.741203
C  1.073503 -0.693811 0.31065
C  -1.092127 -0.640852 1.708949
C  -2.856972 1.291233 0.302711
C  1.911033 -1.608458 -0.582961
C  0.921058 1.797754 0.173985
C  -3.97703 1.507659 -0.713935
C  0.856265 2.992977 -0.769436
H  -0.848256 -1.676077 -0.162807
H  0.06463 -2.408694 1.188275
H  1.65667 -0.438569 1.215677
H  -0.777373 0.405025 1.850686
H  -1.252431 -1.126563 2.68328
H  0.814455 0.47294 -1.450786
H  -2.934115 1.921343 1.205575
H  -1.85406 1.377643 -0.145818
H  -3.915713 0.738656 -1.504932
H  -4.976699 1.451277 -0.247659
H  -3.87488 2.502192 -1.186408
H  0.113562 3.715673 -0.391882
H  1.835913 3.502993 -0.767589
H  0.601922 2.720253 -1.807811
H  2.888406 -3.312839 -0.49143
