program: Gaussian 09
title: 000168500
version: EM64L-G09RevD.01
frameworkgroup: C1[X(C14H22O2)]
method: RPBEPBE
basis: SDD
operation: Freq
keyword: #pfreq=noraman
keyword: PBEPBE/SDD
title: #p freq=noraman PBEPBE/SDD
converged: YES YES NO NO
title: Mulliken charges:
elementType: O O C C C C C C C C C C C C C C H H H H H H H H H H H H H H H H H H H H H H
charge: -0.304497 -0.251000 0.299372 0.349852 -0.202724 -0.091907 -0.551748 -0.522892 -0.482833 -0.822928 -0.785290 -0.793348 0.153933 0.340867 -0.761845 -0.638069 0.242012 0.281016 0.226570 0.241712 0.214227 0.257313 0.204574 0.231514 0.213494 0.218894 0.227264 0.214358 0.239927 0.213776 0.213137 0.213921 0.236393 0.238879 0.237378 0.215656 0.227868 0.255177
chargesum: 0.00000
title: Mulliken charges with hydrogens summed into heavy atoms:
elementType: O O C C C C C C C C C C C C C C
charge: -0.304497 -0.251000 0.299372 0.349852 0.039288 0.189109 -0.083467 -0.051353 -0.046745 -0.163276 -0.117229 -0.129897 0.153933 0.340867 -0.069932 -0.155024
polarizability: 1.95362262e+02 4.97862223e+00 1.41914242e+02 3.01910998e-01 3.94677055e-01 1.21791495e+02
1716.lowfreq: -10.1419 -3.5188 -0.0009 -0.0002 0.0002 13.9910 27.4229 47.6748 64.1081
frequency: 25.1837 47.0119 63.9420 64.5091 126.6552 162.2015 172.0558 188.0633 197.8512 208.6085 217.4013 222.8781 250.6691 282.8308 318.1066 345.8484 355.0347 380.8782 383.9449 421.1828 422.7659 468.1039 503.1150 543.1102 560.7130 581.7805 591.5665 634.6910 636.7362 727.5280 778.1719 784.0117 802.7415 832.0988 835.8664 881.2157 914.0677 935.2226 942.3195 945.3497 948.8569 959.9244 975.7661 988.5471 989.3895 1009.0032 1009.3364 1038.5494 1047.5163 1051.9218 1079.1140 1103.3075 1119.2604 1138.4277 1152.1518 1161.2108 1195.8150 1205.0921 1220.3258 1229.6096 1249.0093 1264.3294 1271.4705 1290.2768 1296.1871 1304.0613 1319.1061 1366.6166 1384.8654 1388.6200 1395.0515 1402.6440 1413.8377 1456.1956 1460.1340 1463.1546 1470.9688 1472.4777 1475.6580 1481.1953 1484.5714 1486.1242 1497.8514 1506.7302 1602.3923 1653.3752 2969.8692 2973.8580 2978.0116 2987.4903 3003.4078 3017.4292 3018.8428 3041.7286 3050.5756 3053.0963 3056.6499 3059.0693 3061.5811 3065.3662 3070.7702 3078.1620 3084.6116 3086.1479 3090.3406 3095.3349 3102.6334 3214.5044
redmass: 3.7350 3.5533 4.3358 3.6093 1.4608 1.8606 1.0498 2.3631 1.1979 1.3562 2.2465 2.9083 2.4146 3.0371 2.2726 2.3339 3.2240 2.6489 3.0124 2.4837 2.5717 2.6861 2.9372 4.3652 4.1314 3.4505 3.7970 1.8430 2.5809 2.7837 2.4848 2.0548 2.9637 3.1747 1.6848 2.3277 2.3318 1.8069 1.8015 1.9058 1.4195 1.7935 2.2933 1.3186 1.5888 1.4261 2.2189 1.7175 2.0915 1.5163 1.2450 1.7193 3.1477 2.1952 2.1040 1.8012 1.9017 1.6855 1.7782 1.8125 1.7896 1.6383 1.9190 2.8368 1.7491 1.6166 2.1460 1.2597 1.2020 1.2303 1.1684 1.1889 1.2492 1.0456 1.0652 1.0574 1.0582 1.0526 1.0651 1.0600 1.0556 1.0665 1.0644 1.0785 11.5519 5.1953 1.0361 1.0373 1.0374 1.0361 1.0596 1.0643 1.0616 1.0862 1.0904 1.0988 1.1018 1.0980 1.0980 1.0987 1.0970 1.1021 1.1017 1.0977 1.0970 1.1007 1.0618 1.1155
irintensity: 1.0724 0.6762 1.6220 0.6396 0.8584 0.2884 0.9619 0.9066 0.4838 1.1636 1.9324 0.8510 0.6154 0.5920 0.8116 1.7211 6.1943 1.2610 1.6799 0.5579 1.2984 0.6823 0.7661 1.4748 2.4136 0.3822 0.8074 5.9972 3.7565 3.0744 4.4648 8.4080 4.1161 7.5386 4.9663 4.0680 2.2212 3.4781 4.8674 2.6574 4.0960 3.2061 74.0276 57.3144 11.3428 8.0643 30.7733 2.1067 9.4241 7.2643 4.1810 196.6949 276.3142 2.8511 4.1359 12.6695 4.0435 1.5417 1.7169 1.7301 1.4073 0.0412 1.5363 85.6158 24.7957 3.4497 1.9413 7.4995 10.1926 13.3348 22.0170 28.3109 11.8943 16.7221 0.4190 3.3331 23.7697 22.9269 26.7919 10.3426 2.7761 6.1520 14.5849 10.6703 129.1644 4.2607 25.7582 21.1808 57.7002 16.3971 34.4431 36.3693 35.7938 10.3328 31.1373 4.4242 16.5607 74.0605 32.5984 17.4959 17.5223 6.0605 93.0972 47.8740 15.6319 30.7910 5.9656 5.9706
temp: 298.150 k
press: 1.00000 atm
elementType: 8 8 6 6 6 6 6 6 6 6 6 6 6 6 6 6 1 1 1 1 1 1 1 1 1 1 1 1 1 1 1 1 1 1 1 1 1 1
symmnumber: 1
zpe: 863677.1 jmol-1
zpe.correction: 0.328957 hartree
zpe.thermalcorrener: 0.346035 hartree
zpe.thermalcorrenthalpy: 0.346979 hartree
zpe.thermalcorrgfe: 0.284565 hartree
zpe.sumelectzpe: -695.869005 hartree
zpe.sumelectthermal: -695.851927 hartree
zpe.sumelectthermalent: -695.850983 hartree
zpe.sumelectthermalfe: -695.913397 hartree
dipole: 0.9180 1.9685 0.0096
dipole: 2.1720
quadrupole: -90.0284 -102.0518 -98.1724
quadrupole: -7.0177 -0.1356 0.0033
quadrupole: 6.7225 -5.3010 -1.4215 -7.0177 -0.1356 0.0033
hfenergy: -696.1979619 hartree
pointgroup: C01 [X(C14H22O2)]
dipole: -0.3652202 0.7155171 0.2913455 debye
polarizability: 195.2801467|-3.2340743|139.3799539|-4.6529772|6.5821613|124.4078984 unknown
InChI: InChI=1S/C14H22O2/c1-9(2)12(15)16-11-8-10-6-7-14(11,5)13(10,3)4/h10-11H,1,6-8H2,2-5H3
charge 0 multiplicity 1
38 atoms
O  1.156515 0.24215 -0.083596
O  2.272504 -1.68885 -0.774958
C  -1.284496 0.588594 -0.466003
C  -2.544558 -0.323259 -0.125459
C  -1.983578 -0.722508 1.290746
C  -0.146098 -0.458218 -0.290135
C  -1.230828 1.543674 0.774533
C  -0.579148 -1.307317 0.949715
C  -1.750295 0.660815 1.965568
C  -1.267013 1.308386 -1.816976
C  -2.756911 -1.525021 -1.082482
C  -3.879434 0.457916 -0.079668
C  2.30796 -0.497362 -0.374889
C  3.547855 0.321122 -0.1467
C  3.406128 1.744209 0.352373
C  4.743344 -0.276412 -0.407206
H  -2.622851 -1.407861 1.873407
H  -0.020994 -1.083896 -1.19072
H  -1.875373 2.424879 0.605486
H  -0.204631 1.912396 0.93699
H  0.131158 -1.175327 1.784889
H  -0.606551 -2.382296 0.705849
H  -1.016248 0.589676 2.788186
H  -2.685333 1.064124 2.393964
H  -1.319612 0.595897 -2.662061
H  -2.11803 2.008816 -1.906255
H  -0.336951 1.895192 -1.933644
H  -2.96389 -1.171444 -2.110586
H  -1.899028 -2.215758 -1.132934
H  -3.634174 -2.115419 -0.75657
H  -4.202879 0.731369 -1.101811
H  -4.673873 -0.175351 0.359305
H  -3.826647 1.386272 0.512682
H  2.801814 2.350736 -0.345943
H  2.882865 1.772714 1.325298
H  4.395738 2.217747 0.469029
H  5.690965 0.254863 -0.267038
H  4.779278 -1.310645 -0.766688
