program: Gaussian 09
title: 000168401
version: EM64L-G09RevD.01
frameworkgroup: C1[X(C12H23NOS2)]
method: RPBEPBE
basis: SDD
operation: Freq
keyword: #p
keyword: freq=noraman
keyword: PBEPBE/SDD
title: #p freq=noraman PBEPBE/SDD
converged: YES YES NO NO
title: Mulliken charges:
elementType: S S O N C C C C C C C C C C C C H H H H H H H H H H H H H H H H H H H H H H H
charge: 0.011039 0.061267 -0.288649 -0.133927 -0.439795 -0.346671 -0.356704 -0.343788 -0.386090 -0.531634 -0.708495 0.240140 -0.377184 -0.347381 -0.648514 -0.662838 0.272074 0.202385 0.233148 0.187534 0.203370 0.223611 0.249390 0.210501 0.232288 0.224159 0.230562 0.275184 0.266655 0.238252 0.221020 0.258877 0.199520 0.219745 0.222170 0.218279 0.202799 0.252091 0.215609
chargesum: 0.00000
title: Mulliken charges with hydrogens summed into heavy atoms:
elementType: S S O N C C C C C C C C C C C C
charge: 0.011039 0.061267 -0.288649 -0.133927 -0.167721 0.088862 0.034200 0.129213 0.056700 -0.076913 -0.166657 0.240140 0.082088 0.111015 0.011681 0.007661
polarizability: 2.33212963e+02 6.59669246e+00 1.46993938e+02 7.66760418e-02 9.13734047e+00 1.45881499e+02
1716.lowfreq: -3.5236 -0.0023 -0.0016 0.0020 4.6879 6.8368 19.3821 25.7295 27.9506
frequency: 19.1338 24.3633 27.5712 38.0777 58.2009 62.0069 77.5733 99.0202 111.6236 129.4218 136.6015 160.5474 172.9228 212.3942 217.6540 242.6081 264.0296 310.4380 327.6236 340.0275 378.8053 401.6171 418.5726 437.1044 457.9736 497.8890 535.1643 566.4093 569.2702 594.6992 625.3153 727.4283 746.7407 778.7690 786.8180 790.8519 854.1445 891.8720 901.2948 924.3537 939.7673 989.4210 1002.6043 1022.5746 1042.5602 1050.3330 1063.4225 1070.1269 1080.1720 1087.8988 1094.9321 1098.0998 1123.8749 1129.6607 1143.2943 1161.2456 1215.2664 1222.0448 1226.6632 1253.3204 1264.2155 1270.0283 1278.6054 1288.9128 1298.4860 1302.2554 1316.2836 1338.9027 1344.0274 1351.7866 1359.5135 1361.5579 1384.1271 1386.2544 1415.3074 1434.4928 1439.4355 1443.4183 1448.0253 1456.4310 1459.3472 1467.1645 1469.8478 1476.6582 1478.2131 1482.4712 1494.9460 1582.8586 2946.8282 2959.2233 2960.7524 2980.0181 2982.4891 2984.0676 2992.0389 2995.5917 2999.8260 3003.3152 3009.1514 3012.5401 3023.6243 3037.2349 3058.1378 3063.9950 3065.3774 3065.7675 3082.4282 3082.9672 3092.9783 3101.4059 3101.6887
redmass: 4.7476 4.7155 8.4354 4.1014 3.3756 3.2769 3.2138 2.0495 3.4889 3.2073 2.8599 2.1093 3.1914 1.0943 1.3456 1.9332 2.6121 3.0548 4.7597 3.1113 3.0490 4.0690 4.2612 3.8412 3.3440 2.8407 2.9699 3.4565 3.1312 3.2427 4.9920 1.1090 3.0590 1.1561 1.3239 1.3019 1.6614 1.5290 2.4909 1.8348 2.1562 1.9233 3.7433 2.8638 2.1230 1.7994 2.5772 2.0615 1.8400 2.3339 1.8160 1.7685 1.2966 1.4360 1.9573 1.4334 2.8707 1.3496 1.3481 1.3998 1.2678 1.2487 1.2332 1.0811 1.1596 1.3217 1.3171 1.3785 1.2782 1.4731 1.3156 1.6088 1.2161 1.2124 2.3990 1.0885 1.0931 1.1019 1.0811 1.1192 1.0836 1.0456 1.0430 1.0969 1.0599 1.0561 1.1071 6.3830 1.0593 1.0625 1.0602 1.0614 1.0361 1.0353 1.0924 1.0661 1.0664 1.0636 1.0868 1.0972 1.0582 1.0998 1.0990 1.0967 1.1020 1.0993 1.0990 1.0992 1.1010 1.1017 1.1085
irintensity: 2.9994 1.3571 0.2766 1.9251 1.1594 1.0744 1.6728 0.0829 1.5116 1.0164 1.1641 1.3740 0.3832 0.2398 0.6869 0.4295 1.6160 0.0851 7.2479 6.7723 4.8119 1.1501 0.8856 8.1864 2.1148 0.8937 2.6918 4.4606 3.9825 3.8282 1.0036 10.2617 1.7826 3.1580 13.2058 4.3242 4.1441 0.7249 9.6041 21.5705 7.5991 6.2471 2.7318 6.0766 4.6348 0.3773 3.9186 11.6194 6.5768 6.5693 6.4950 15.2760 1.6209 1.7823 47.7556 2.7008 29.5292 2.5891 3.9222 83.6026 16.4531 3.7130 17.8402 0.0830 13.2703 19.7458 10.0547 3.2442 3.9844 0.7970 8.2203 1.8468 6.4007 35.5962 119.9152 4.1946 8.2751 33.2003 0.8423 18.8339 0.4524 3.8617 15.1263 14.1396 11.7758 11.3486 10.2879 241.6292 13.8018 20.8346 28.0468 29.8510 27.6859 22.7848 16.9231 35.9214 27.7125 40.7730 1.6243 11.1847 24.4727 16.5827 19.5628 8.3183 60.6252 12.5264 26.8154 58.5239 47.7270 32.5678 18.5980
temp: 298.150 k
press: 1.00000 atm
elementType: 16 16 8 7 6 6 6 6 6 6 6 6 6 6 6 6 1 1 1 1 1 1 1 1 1 1 1 1 1 1 1 1 1 1 1 1 1 1 1
symmnumber: 1
zpe: 877037.6 jmol-1
zpe.correction: 0.334046 hartree
zpe.thermalcorrener: 0.354017 hartree
zpe.thermalcorrenthalpy: 0.354961 hartree
zpe.thermalcorrgfe: 0.281651 hartree
zpe.sumelectzpe: -1395.882845 hartree
zpe.sumelectthermal: -1395.862874 hartree
zpe.sumelectthermalent: -1395.861929 hartree
zpe.sumelectthermalfe: -1395.935240 hartree
dipole: 2.2025 2.3019 -2.9115
dipole: 4.3159
quadrupole: -103.9271 -120.4117 -113.6017
quadrupole: 20.4771 17.0131 -0.7550
quadrupole: 8.7198 -7.7649 -0.9549 20.4771 17.0131 -0.7550
hfenergy: -1396.2168908 hartree
pointgroup: C01 [X(C12H23N1O1S2)]
dipole: -0.8338761 0.8692434 1.1967674 debye
polarizability: 233.2147608|-6.1951386|147.3528277|-2.9726068|-8.8944566|145.5208111 unknown
InChI: InChI=1S/C12H23NOS2/c1-3-13(4-2)12(14)8-6-5-7-11-9-10-15-16-11/h11H,3-10H2,1-2H3
charge 0 multiplicity 1
39 atoms
S  4.103363 0.895829 -1.266441
S  6.387743 0.464295 -1.305341
O  -2.604246 -1.815784 0.09676
N  -3.800416 0.168767 -0.049435
C  3.826655 0.064486 0.4534
C  2.496188 -0.711893 0.431521
C  1.257016 0.172389 0.169499
C  5.045238 -0.8299 0.763789
C  -0.063183 -0.622899 0.250835
C  -1.294763 0.260923 -0.027162
C  6.363531 -0.085549 0.506276
C  -2.605782 -0.544199 0.014305
C  -3.892491 1.641615 -0.147326
C  -5.074493 -0.591718 -0.018371
C  -4.091123 2.331928 1.222392
C  -5.565328 -0.979878 -1.429566
H  3.776897 0.901734 1.174556
H  2.38007 -1.216163 1.414789
H  2.558319 -1.507525 -0.336235
H  1.240067 1.007398 0.901812
H  1.349431 0.636942 -0.835289
H  4.993972 -1.145216 1.8260
H  5.003427 -1.738591 0.134631
H  -0.166186 -1.08657 1.250892
H  -0.051173 -1.461659 -0.469154
H  -1.334649 1.09446 0.702537
H  -1.190325 0.730735 -1.027959
H  7.240867 -0.742717 0.633085
H  6.465001 0.804867 1.148675
H  -2.988625 2.036667 -0.640401
H  -4.742966 1.885515 -0.81287
H  -4.901846 -1.504902 0.575669
H  -5.831576 0.025568 0.501534
H  -5.003271 1.961961 1.723816
H  -3.234121 2.136016 1.891106
H  -4.189866 3.425841 1.095088
H  -5.713858 -0.088901 -2.067629
H  -4.828754 -1.641471 -1.915925
H  -6.528344 -1.5196 -1.367363
