program: Gaussian 09
title: 000168356
version: EM64L-G09RevD.01
frameworkgroup: C1[X(C5H9NO3)]
method: RPBEPBE
basis: SDD
operation: Freq
keyword: #pfreq=noraman
keyword: PBEPBE/SDD
title: #p freq=noraman PBEPBE/SDD
converged: NO YES NO NO
title: Mulliken charges:
elementType: O O O N C C C C C H H H H H H H H H
charge: -0.420402 -0.250310 -0.223694 -0.621092 -0.359833 -0.516537 -0.473001 0.228981 0.175297 0.241825 0.244251 0.230233 0.229979 0.244558 0.244777 0.313527 0.334789 0.376650
chargesum: 0.00000
title: Mulliken charges with hydrogens summed into heavy atoms:
elementType: O O O N C C C C C
charge: -0.043753 -0.250310 -0.223694 0.027225 0.126243 -0.056324 0.016335 0.228981 0.175297
polarizability: 8.83376003e+01 2.74852920e+00 7.38124534e+01 -1.39842815e-01 -3.51571775e-02 4.42502357e+01
1716.lowfreq: -32.1996 -5.8125 -0.0008 -0.0007 0.0003 5.1592 10.3510 31.7014 65.2463
frequency: -31.3045 28.2120 65.0421 89.6489 105.2944 216.8547 258.3033 407.7469 469.2594 476.4886 500.6354 518.8409 580.4833 599.3907 627.3194 634.9287 739.4007 815.3668 854.3611 886.5727 1015.7573 1048.8195 1063.7375 1079.3306 1096.0651 1141.5374 1224.4833 1253.6273 1257.8555 1285.4414 1304.8201 1364.3876 1379.8724 1438.3685 1447.9335 1473.7001 1597.2795 1647.8231 1673.2989 2964.8740 2985.4491 3014.5290 3031.9610 3033.3213 3095.4512 3514.6915 3516.7551 3673.3628
redmass: 4.0400 3.2061 2.9273 6.2017 2.2611 5.9647 6.4178 4.0271 3.4084 1.3715 1.6508 1.3439 4.1685 4.6912 1.4301 1.3257 1.2927 4.0070 1.6043 3.4512 3.3569 2.0050 1.9902 2.1480 3.0536 1.2261 1.3769 1.6191 1.2104 1.0713 2.1228 2.4773 1.9527 1.0897 1.0792 1.0887 1.3857 3.9438 8.3054 1.0592 1.0608 1.0994 1.0982 1.0614 1.1033 1.0639 1.0445 1.1044
irintensity: 3.4481 0.1703 0.0502 1.8290 0.0032 13.5980 1.1378 8.1830 47.2107 35.7493 0.3061 241.2548 5.6037 3.0168 48.3098 142.9064 30.5511 1.4926 0.0700 2.3846 159.8460 72.9340 2.6549 2.1187 64.2621 0.1981 4.5264 7.9434 0.4517 0.4233 181.5948 17.8907 69.6378 14.0476 19.0796 19.6309 62.4485 250.2435 243.1160 20.6882 12.6491 17.7827 4.4945 8.2686 27.8184 20.4240 26.7568 22.8378
temp: 298.150 k
press: 1.00000 atm
elementType: 8 8 8 7 6 6 6 6 6 1 1 1 1 1 1 1 1 1
symmnumber: 1
zpe: 373825.1 jmol-1
zpe.correction: 0.142382 hartree
zpe.thermalcorrener: 0.151802 hartree
zpe.thermalcorrenthalpy: 0.152746 hartree
zpe.thermalcorrgfe: 0.106131 hartree
zpe.sumelectzpe: -475.668142 hartree
zpe.sumelectthermal: -475.658723 hartree
zpe.sumelectthermalent: -475.657779 hartree
zpe.sumelectthermalfe: -475.704393 hartree
dipole: -1.1234 -5.3800 0.0343
dipole: 5.4962
quadrupole: -38.4588 -60.7068 -52.8429
quadrupole: 9.3691 -0.1731 -0.1073
quadrupole: 12.2107 -10.0373 -2.1734 9.3691 -0.1731 -0.1073
hfenergy: -475.8105244 hartree
pointgroup: C01 [X(C5H9N1O3)]
dipole: -0.4139217 -2.1221249 0.0325734 debye
dipolederiv: -1.1004869 0.5077793 0.0134475 0.4379459 -0.5474483 -0.0072075 0.0140573 -0.0065638 -0.436087 -0.6697352 0.0694165 -0.001518 -0.1595732 -1.0019908 0.0127697 0.0033001 0.0155653 -0.3469112 -0.6654611 -0.1352344 0.0024562 0.1288929 -0.957934 -0.0064516 0.0063348 -0.0046701 -0.3017961 -1.0255422 -0.4884665 0.0109223 -0.3239717 -0.4853403 -0.0055809 0.0061081 -0.0063384 -0.7295782 0.1146988 -0.0091562 0.0005623 -0.0073883 0.015946 0.0018757 -0.0008877 -0.0001956 0.1256122 -0.2648234 0.0905608 -0.0021728 0.2618368 -0.0812806 0.008125 -0.0062794 0.0082662 0.2076763 -0.2106739 -0.1048871 0.005367 -0.2751871 -0.1132066 0.0053881 0.0144693 0.0071848 0.1663288 1.4167478 0.3095292 -0.0043777 0.2882785 1.2956581 -0.0226252 -0.0025264 -0.0235377 0.1842757 1.5163673 -0.1708882 -0.0217309 -0.2536196 1.3462513 0.0116728 -0.0275166 0.009444 0.1842195 0.0649019 0.0013043 0.0023031 -0.0009637 0.0280285 0.0853878 -0.000434 0.0774063 -0.0455256 0.0685469 0.0003542 -0.0030438 -0.0011248 0.0206102 -0.0874883 0.0002331 -0.0786594 -0.0329794 0.0324532 0.0076045 0.010248 -0.021802 -0.0020946 0.0995487 0.0089104 0.1229549 -0.0546936 0.0314841 0.0057957 -0.0117527 -0.0236531 -0.015349 -0.1018682 -0.0082542 -0.1256856 -0.0413424 0.0545405 -0.0114492 -0.0056922 0.0369785 0.0367927 0.0868413 -0.0217425 0.1067999 -0.0258106 0.0544572 -0.009367 0.0063304 0.0395099 0.0268204 -0.0904543 0.0162913 -0.1107099 -0.0156208 0.2116992 0.0217499 -0.0012123 0.0198753 0.1088327 0.0056634 -0.0012796 0.0051665 0.3826229 0.1459394 0.0158499 -0.0008792 0.0044139 0.1576122 0.0047169 -0.001357 0.0047646 0.3871237 0.2248864 -0.1004954 0.0007427 -0.1504484 0.1680921 -0.0003135 0.0005732 -0.0011919 0.3924858 unknown
polarizability: 88.2617209|2.9375504|73.8847405|-0.2449607|-0.2980867|44.253828 unknown
InChI: InChI=1S/C5H9NO3/c6-4(7)2-1-3-5(8)9/h8H,1-3,6H2
charge 0 multiplicity 1
18 atoms
O  3.684155 -0.726906 -0.034194
O  -2.590952 1.316734 -0.034335
O  2.640169 1.346431 0.000226
N  -3.726524 -0.70212 0.006768
C  -0.004329 0.12169 -0.015609
C  -1.260198 -0.768666 0.01399
C  1.277969 -0.729918 0.004792
C  -2.560858 0.052955 -0.004669
C  2.546449 0.100971 -0.011718
H  -0.022422 0.763827 -0.913101
H  -0.016425 0.814828 0.842881
H  -1.257503 -1.407037 0.921664
H  -1.263205 -1.459122 -0.854647
H  1.317699 -1.377064 0.904062
H  1.32011 -1.421471 -0.859896
H  -3.715942 -1.720276 0.027405
H  -4.621238 -0.213002 -0.006044
H  4.500043 -0.155855 -0.037975
