program: Gaussian 09
title: 000168724
version: EM64L-G09RevD.01
frameworkgroup: C1[X(C24H28O2)]
method: RPBEPBE
basis: SDD
operation: Freq
keyword: #pfreq=noraman
keyword: PBEPBE/SDD
title: #p freq=noraman PBEPBE/SDD
converged: YES YES NO NO
title: Mulliken charges:
elementType: O O C C C C C C C C C C C C C C C C C C C C C C C C H H H H H H H H H H H H H H H H H H H H H H H H H H H H
charge: -0.284631 -0.270670 0.309426 -0.260572 -0.371011 -0.739321 -0.735026 -0.267421 0.271429 0.361858 -0.795189 -0.791541 -0.493294 0.486586 -0.594777 -0.429824 0.508196 -0.223114 -0.378610 -0.712160 0.498202 -0.373441 -0.453442 -0.224322 -0.220765 -0.249779 0.257474 0.259629 0.257221 0.210802 0.207244 0.220525 0.213944 0.222578 0.195945 0.233636 0.219405 0.221370 0.227833 0.217899 0.216336 0.243473 0.218501 0.277362 0.235458 0.225442 0.246038 0.223797 0.235609 0.238751 0.231581 0.223495 0.224563 0.227299
chargesum: 0.00000
title: Mulliken charges with hydrogens summed into heavy atoms:
elementType: O O C C C C C C C C C C C C C C C C C C C C C C C C
charge: -0.284631 -0.270670 0.309426 -0.003097 -0.111382 -0.064054 -0.077980 -0.071476 0.271429 0.361858 -0.120777 -0.129473 -0.031320 0.486586 -0.317416 -0.194366 0.508196 0.002328 -0.132571 -0.252754 0.498202 -0.134689 -0.221861 -0.000826 0.003797 -0.022480
polarizability: 3.62245840e+02 2.20225941e+01 2.39457472e+02 5.38580140e+00 -1.84515566e+00 2.04838087e+02
1716.lowfreq: -9.4529 -7.5215 -5.2590 -2.4306 -0.0011 -0.0007 0.0006 6.3179 16.4556
frequency: -7.2819 5.1510 16.3134 21.3819 25.7303 29.6437 54.1104 67.6008 73.7721 97.9979 108.5260 128.3011 132.8831 167.2203 171.4211 187.3977 188.0596 206.6172 215.5039 226.7941 239.9702 272.8303 277.3069 307.6564 311.9210 319.9628 351.0357 364.7941 391.2029 403.9535 413.3854 430.4903 437.4375 457.3209 466.2487 501.2285 510.4924 517.7343 552.2177 585.2558 612.7375 619.0483 648.0369 685.8166 704.2905 706.5642 720.8205 733.0174 754.5902 767.7040 801.5582 816.5302 821.9329 837.0892 854.0792 861.6589 894.1152 898.0198 913.0056 926.7415 936.5871 942.3877 948.5586 958.0017 959.8476 976.1780 976.6995 987.1027 990.3362 990.8894 991.4419 993.7562 996.1275 1002.1002 1026.8862 1040.2537 1048.4720 1072.9079 1080.9710 1081.4941 1097.9031 1123.2103 1153.0841 1167.5663 1170.9352 1179.2259 1182.9585 1185.8510 1188.7531 1208.4155 1223.3303 1234.2476 1241.7996 1258.8664 1281.6683 1288.2218 1320.6550 1322.7656 1336.3638 1348.6828 1357.7416 1381.0104 1386.5689 1387.6788 1389.6323 1398.9085 1400.7141 1408.1339 1439.6433 1440.5533 1454.4655 1459.6079 1461.1476 1463.5788 1466.2237 1470.5895 1471.0532 1475.7659 1481.7954 1483.8644 1484.4775 1488.6368 1592.2786 1599.2049 1610.8056 1613.3597 1617.4994 1686.0000 2955.7363 2964.0250 2972.7806 2974.0266 2977.2171 3021.0499 3026.4469 3031.0051 3034.8338 3053.9831 3064.1160 3076.0631 3081.3487 3090.5264 3095.7356 3105.1030 3108.7718 3114.6595 3118.0128 3118.2783 3128.9698 3129.3590 3132.1437 3134.2890 3142.8807 3143.1351 3153.2691 3161.4256
redmass: 3.8788 4.8360 3.8065 3.2607 4.4579 4.3340 4.2258 4.5863 4.1852 2.3881 1.3107 3.7270 2.8084 2.0028 1.2849 1.4514 3.4215 3.0745 2.7484 2.3641 1.8011 4.2258 3.0890 3.1202 3.2758 2.5225 3.4980 2.4424 2.2208 2.8064 2.4444 3.0960 2.9502 3.1938 3.0942 3.0459 3.8324 3.6368 5.3659 4.8562 4.6597 5.9693 4.6975 4.4175 1.9946 2.6437 4.4743 2.1170 2.2460 3.6928 3.1166 3.7826 2.1499 2.8797 1.2485 1.5955 1.9589 2.2049 2.2604 1.5682 3.0786 1.7438 1.3952 1.3934 1.8137 1.4164 1.3970 1.5205 3.5040 5.6551 1.2707 1.5969 1.6737 1.4469 2.2003 1.5759 1.5648 1.4500 1.6046 1.5874 1.6549 1.8700 3.0484 1.6853 1.0597 2.0287 1.1296 1.1163 1.1200 2.5040 3.2141 1.2520 1.9990 2.9466 1.4811 1.6198 1.7031 1.2593 1.3371 1.3329 1.7192 6.9466 6.7793 1.2352 1.2949 1.3436 1.3373 1.7751 2.1759 2.6691 1.0497 1.2013 1.1255 1.0511 1.0514 1.0463 1.0512 1.0855 2.3363 1.1646 1.8872 1.0878 6.0516 5.9676 7.5700 7.0080 6.3406 6.3837 1.0373 1.0389 1.0379 1.0597 1.0366 1.1005 1.0970 1.0963 1.0584 1.0986 1.0988 1.0981 1.0970 1.0898 1.0960 1.0972 1.1072 1.0865 1.0866 1.0867 1.0918 1.0921 1.0912 1.0891 1.0866 1.0960 1.0992 1.1015
irintensity: 0.1146 0.0052 0.1064 0.0898 0.4216 0.1810 0.4344 0.2008 1.2512 2.1741 0.1432 0.8765 0.1372 0.6104 0.8790 0.2545 2.2694 1.0166 0.1816 0.7407 0.9994 3.7505 0.8372 0.7655 3.0315 5.4399 2.8144 0.8438 4.1106 0.1288 1.6362 4.6461 11.8238 0.8271 15.1508 6.8925 1.1162 18.8720 6.7749 3.7698 5.6373 2.0929 6.6555 0.8235 34.1343 27.7224 1.8676 43.4742 28.9250 20.0266 23.8119 10.3543 18.7304 6.5197 0.2195 24.6019 26.8035 49.0242 6.7378 1.9082 92.3511 10.9023 0.3604 0.8626 2.3038 28.0909 4.0866 0.4833 1.1705 0.4461 4.3019 3.3368 7.1249 13.1226 8.7372 1.5801 33.9246 2.4851 5.4535 14.5215 6.2527 99.2991 109.4198 12.8556 0.2396 41.6796 1.3096 1.5695 2.6001 1.2515 229.4919 1.4607 12.5846 12.5358 22.0594 0.7925 1.7193 1.6145 0.6381 12.2027 14.3872 0.3182 1.5123 1.1505 37.0135 7.8794 23.5290 5.3243 6.2706 9.0209 1.7664 8.9899 35.4380 7.5678 7.6093 23.7005 9.6937 1.9380 23.7899 21.3912 5.7662 8.0611 1.3225 11.6222 173.4449 102.2017 13.0915 2.3678 51.2818 65.4982 27.3129 24.9340 43.7419 11.3134 9.2377 41.9428 35.7100 23.6768 43.7405 19.1895 25.0115 34.2462 39.0826 9.3081 5.6987 8.0974 3.0251 3.0995 20.1058 3.4390 12.7027 2.2292 12.0353 47.7147 24.3553 25.7049
temp: 298.150 k
press: 1.00000 atm
elementType: 8 8 6 6 6 6 6 6 6 6 6 6 6 6 6 6 6 6 6 6 6 6 6 6 6 6 1 1 1 1 1 1 1 1 1 1 1 1 1 1 1 1 1 1 1 1 1 1 1 1 1 1 1 1
symmnumber: 1
zpe: 1183165.7 jmol-1
zpe.correction: 0.450644 hartree
zpe.thermalcorrener: 0.476515 hartree
zpe.thermalcorrenthalpy: 0.477459 hartree
zpe.thermalcorrgfe: 0.390246 hartree
zpe.sumelectzpe: -1079.869382 hartree
zpe.sumelectthermal: -1079.843511 hartree
zpe.sumelectthermalent: -1079.842566 hartree
zpe.sumelectthermalfe: -1079.929779 hartree
dipole: -0.6799 0.1184 -2.2776
dipole: 2.3799
quadrupole: -134.9836 -146.4250 -160.4410
quadrupole: -0.9633 2.4920 1.3742
quadrupole: 12.2996 0.8582 -13.1578 -0.9633 2.4920 1.3742
hfenergy: -1080.3200256 hartree
pointgroup: C01 [X(C24H28O2)]
dipole: -0.0952103 0.6717659 0.6452575 debye
polarizability: 323.3545902|11.892816|224.5983022|67.7736599|-10.3769782|258.5885067 unknown
InChI: InChI=1S/C24H28O2/c1-17(2)13-21-22(24(21,3)4)23(25)26-16-20-12-8-11-19(15-20)14-18-9-6-5-7-10-18/h5-13,15,21-22H,14,16H2,1-4H3
charge 0 multiplicity 1
54 atoms
O  1.348577 -0.867713 1.256068
O  1.851376 -1.824856 -0.817575
C  2.454812 1.778517 -0.037119
C  3.425703 1.154431 0.981119
C  2.886007 0.283609 -0.20438
C  1.042276 2.120719 0.431869
C  2.985739 2.735729 -1.104931
C  4.871342 1.489841 1.057026
C  2.000194 -0.88726 0.008542
C  5.666117 1.443323 2.168316
C  5.198922 1.02164 3.550288
C  7.135024 1.825579 2.086718
C  0.406979 -2.012543 1.533233
C  -1.010113 -1.674822 1.125078
C  -1.431252 -1.859924 -0.217654
C  -1.930389 -1.169088 2.074874
C  -2.74637 -1.536799 -0.625671
C  -3.248588 -0.844636 1.680382
C  -3.652166 -1.023517 0.3403
C  -3.193696 -1.768785 -2.068431
C  -3.893547 -0.579627 -2.726503
C  -3.314266 0.715938 -2.688799
C  -5.119276 -0.752263 -3.416759
C  -3.9412 1.806761 -3.32913
C  -5.751519 0.337839 -4.059189
C  -5.163524 1.622147 -4.01846
H  2.945331 0.897833 1.930525
H  3.579415 0.105096 -1.032761
H  0.678362 1.41759 1.197611
H  1.029112 3.141623 0.858707
H  0.330806 2.099836 -0.41626
H  3.087817 3.756227 -0.68933
H  3.970187 2.432368 -1.500646
H  2.283313 2.78345 -1.957751
H  5.342837 1.805153 0.114369
H  4.135557 0.73603 3.584619
H  5.35678 1.839216 4.281821
H  5.791879 0.157774 3.911487
H  7.427803 2.123416 1.064833
H  7.783258 0.981593 2.397263
H  7.366094 2.668176 2.769206
H  0.790034 -2.896226 0.994448
H  0.497709 -2.149845 2.622334
H  -0.710331 -2.249682 -0.947135
H  -1.616067 -1.026893 3.116267
H  -3.959252 -0.453394 2.417082
H  -4.671398 -0.758588 0.034616
H  -3.875735 -2.641718 -2.102789
H  -2.306545 -2.04957 -2.669948
H  -2.371379 0.865654 -2.148785
H  -5.581839 -1.746832 -3.452653
H  -3.479269 2.800136 -3.291529
H  -6.699363 0.184827 -4.587892
H  -5.650976 2.468812 -4.514924
