program: Gaussian 09
title: 000168380
version: EM64L-G09RevD.01
frameworkgroup: C1[X(C11H22NO4)]
method: RPBEPBE
basis: SDD
operation: Freq
keyword: #p
keyword: freq=noraman
keyword: PBEPBE/SDD
title: #p freq=noraman PBEPBE/SDD
converged: YES YES NO NO
title: Mulliken charges:
elementType: O O O O N C C C C C C C C C C C H H H H H H H H H H H H H H H H H H H H H H
charge: -0.337479 -0.442352 -0.205992 -0.189325 -0.098644 -0.410492 -0.026187 -0.563124 -0.553551 -0.583170 -0.520823 0.289615 -0.208492 0.220602 -0.670580 -0.677012 0.263275 0.323766 0.289713 0.255248 0.315346 0.260230 0.277001 0.269488 0.267186 0.263880 0.271716 0.297107 0.257112 0.301450 0.230344 0.239690 0.246693 0.210632 0.239500 0.257934 0.236747 0.402947
chargesum: 1.00000
title: Mulliken charges with hydrogens summed into heavy atoms:
elementType: O O O O N C C C C C C C C C C C
charge: -0.337479 -0.039405 -0.205992 -0.189325 -0.098644 0.176549 0.263526 0.267701 0.260124 0.249533 0.037740 0.289615 0.021851 0.220602 0.026435 0.057170
polarizability: 1.56834003e+02 2.58190105e+00 1.30177574e+02 1.87402599e+00 -2.95230714e+00 1.18338973e+02
1716.lowfreq: -10.5974 -5.8967 0.0005 0.0007 0.0010 3.0727 21.4803 28.3138 38.6336
frequency: 21.0506 28.2646 38.5231 40.3221 54.0289 74.1428 84.6415 139.6430 166.8641 175.7082 197.1820 214.0529 223.7464 235.8615 244.7966 270.2906 283.5865 285.0978 298.6646 317.3887 349.0592 386.4274 403.9742 427.4887 430.6573 472.7520 484.9825 510.7605 536.2965 646.1085 652.7957 699.5633 710.6891 751.4205 769.5208 796.9842 826.0091 871.4278 896.6061 910.6617 927.1806 930.4530 945.6665 965.0880 995.6339 1011.9974 1022.8655 1047.8519 1055.3071 1094.3936 1095.6662 1102.2221 1112.9697 1136.1297 1171.0164 1191.0083 1216.4688 1225.8576 1254.8203 1272.0817 1277.6674 1298.5681 1305.3268 1330.1760 1344.6189 1362.4669 1381.0659 1384.4289 1403.7329 1419.3394 1423.6387 1447.3260 1450.1516 1450.4416 1458.7127 1465.5378 1470.7442 1471.6588 1472.8176 1480.3978 1481.0152 1489.0542 1490.7770 1504.3356 1670.2592 1686.2462 2994.5619 2995.4650 3019.1559 3022.5873 3023.1016 3026.2288 3028.4211 3028.9180 3032.5169 3090.4824 3101.0630 3102.4464 3107.6240 3107.9623 3111.3076 3138.4926 3140.9468 3144.4734 3145.8833 3154.5580 3164.4943 3508.2649
redmass: 5.5396 2.8509 4.4109 4.9782 5.0975 4.7159 3.5501 4.0212 3.1923 3.7063 1.0730 1.0604 1.8912 2.4863 1.6226 1.8595 1.7135 1.1308 2.8539 2.9444 2.1873 2.5415 2.3903 2.6382 2.5136 2.6282 3.8188 3.0554 3.7045 3.2161 1.3244 4.2971 5.8681 4.1862 3.8943 4.5528 3.5964 2.9536 3.1283 2.9638 2.3589 1.1570 2.8565 1.4708 2.4074 3.6996 2.3391 1.2099 2.0370 1.8020 1.6756 1.7243 1.4097 1.7618 1.8285 1.3360 1.5644 1.6106 1.8875 1.6101 1.3161 1.5730 1.3345 1.3762 1.4445 1.4619 1.3465 1.1809 1.1962 1.1421 1.1545 1.0800 1.0802 1.0798 1.0963 1.0448 1.0473 1.0619 1.0461 1.0473 1.0595 1.0514 1.0580 1.0522 9.6879 8.8317 1.0361 1.0345 1.0782 1.0816 1.0342 1.0346 1.0513 1.0511 1.0585 1.0998 1.1015 1.1015 1.1051 1.1005 1.1007 1.1054 1.1057 1.1054 1.1052 1.1057 1.1053 1.0643
irintensity: 1.3218 0.1480 0.4579 2.4055 3.3286 0.1120 1.5606 0.9933 3.2203 2.2328 0.1382 0.2622 0.0954 1.5641 3.2825 5.1476 2.2979 1.1901 12.9766 1.1288 0.8993 0.2832 0.8657 6.3474 3.4355 0.8727 2.0815 14.9823 32.0057 0.6471 154.4120 20.7003 2.8290 1.0175 47.5604 4.3954 33.8845 27.4590 40.2894 18.5786 32.1639 5.4274 29.2690 1.3185 34.0835 300.4725 201.1756 1.4190 69.5905 39.2475 12.8007 14.1925 5.0190 36.7055 1.1712 6.0368 3.4356 2.5547 0.7654 8.2035 3.4770 19.0531 1.5170 15.2902 2.9913 11.5635 7.5277 13.2762 23.9333 21.9282 14.1997 7.3602 28.3390 2.1873 7.1480 11.6261 1.7972 8.3297 8.2676 8.5883 50.3845 28.2316 30.4973 67.6985 128.4009 236.3744 20.7399 11.7769 9.6368 13.6629 2.3421 6.2292 2.1457 4.2264 19.3224 24.6293 4.2627 13.1468 4.2533 25.1148 0.3884 0.3385 0.9003 5.0019 8.9061 2.0333 3.9810 50.2432
temp: 298.150 k
press: 1.00000 atm
elementType: 8 8 8 8 7 6 6 6 6 6 6 6 6 6 6 6 1 1 1 1 1 1 1 1 1 1 1 1 1 1 1 1 1 1 1 1 1 1
symmnumber: 1
zpe: 857197.2 jmol-1
zpe.correction: 0.326489 hartree
zpe.thermalcorrener: 0.346035 hartree
zpe.thermalcorrenthalpy: 0.346980 hartree
zpe.thermalcorrgfe: 0.276948 hartree
zpe.sumelectzpe: -786.476884 hartree
zpe.sumelectthermal: -786.457338 hartree
zpe.sumelectthermalent: -786.456394 hartree
zpe.sumelectthermalfe: -786.526425 hartree
dipole: 10.9653 -3.1096 -1.9290
dipole: 11.5598
quadrupole: -54.4338 -79.1882 -87.6691
quadrupole: -4.1341 2.6948 2.4983
quadrupole: 19.3299 -5.4245 -13.9054 -4.1341 2.6948 2.4983
hfenergy: -786.8033732 hartree
pointgroup: C01 [X(C11H22N1O4)]
dipole: -4.3226539 -1.013931 0.9851941 debye
polarizability: 156.5956281|-3.798046|130.3993367|-0.2108501|3.3049111|118.3555852 unknown
InChI: InChI=1S/C11H22NO4/c1-8(2)11(15)16-9(6-10(13)14)7-12(3,4)5/h8-9,13H,6-7H2,1-5H3
charge 1 multiplicity 1
38 atoms
O  0.33799 -0.270906 0.11538
O  -0.611456 3.0723 0.79169
O  1.497186 -1.028004 -1.767297
O  1.650599 2.840086 0.298684
N  -2.632479 -0.789268 0.337531
C  -1.968242 0.539945 -0.10853
C  -0.605697 0.416589 -0.805841
C  -2.044972 -1.256378 1.675382
C  -4.126547 -0.517483 0.531079
C  -2.462261 -1.888333 -0.70912
C  -0.029554 1.80733 -1.187589
C  1.464663 -0.911604 -0.528701
C  2.50821 -1.332235 0.484843
C  0.464208 2.606952 0.009803
C  3.07668 -2.728795 0.137144
C  3.631071 -0.247233 0.493066
H  -2.670102 1.016312 -0.815867
H  -1.895443 1.178766 0.786199
H  -0.673343 -0.172067 -1.740255
H  -2.477742 -2.237523 1.924677
H  -0.953571 -1.315309 1.573908
H  -2.310071 -0.520896 2.450322
H  -4.249782 0.350543 1.1964
H  -4.587404 -0.308293 -0.446381
H  -4.596253 -1.404044 0.983895
H  -3.060464 -2.759457 -0.400387
H  -2.817922 -1.521799 -1.684282
H  -1.402883 -2.172382 -0.774017
H  -0.794287 2.392366 -1.730196
H  0.828185 1.651562 -1.860292
H  2.033082 -1.346338 1.483086
H  3.874125 -2.990696 0.85333
H  3.50836 -2.730639 -0.878166
H  2.303133 -3.516457 0.184098
H  4.36907 -0.504673 1.271949
H  3.23471 0.760666 0.705551
H  4.149699 -0.223143 -0.481226
H  -0.267498 3.637538 1.536828
