program: Gaussian 09
title: 000013057
version: EM64L-G09RevD.01
frameworkgroup: C1[X(C10H8N2O2)]
method: RPBEPBE
basis: SDD
operation: Freq
keyword: #p
keyword: freq=noraman
keyword: PBEPBE/SDD
title: #p freq=noraman PBEPBE/SDD
converged: NO NO NO NO
title: Mulliken charges:
elementType: O O N N C C C C C C C C C C H H H H H H H H
charge: -0.234921 -0.241926 0.017297 -0.669662 0.286440 0.305723 0.201878 0.318866 -0.384596 -0.363375 -0.416115 -0.460897 -0.237499 -0.263990 0.312103 0.193701 0.288348 0.228258 0.236722 0.234139 0.325838 0.323668
chargesum: 0.00000
title: Mulliken charges with hydrogens summed into heavy atoms:
elementType: O O N N C C C C C C C C C C
charge: -0.234921 -0.241926 0.017297 -0.020157 0.286440 0.305723 0.201878 0.318866 -0.072493 -0.169673 -0.127766 -0.232639 -0.000777 -0.029851
polarizability: 2.03216813e+02 2.43604194e+00 1.77622231e+02 2.97183025e-03 7.53455484e-03 4.97428957e+01
1716.lowfreq: -18.5381 -9.3935 -3.1440 -0.0003 0.0005 0.0011 5.0995 81.2171 97.2356
frequency: -6.5168 81.2118 97.1994 187.4857 236.8833 306.6782 307.8896 343.8605 365.1920 392.5927 422.9062 468.0878 473.8251 486.5329 517.8121 558.0971 575.1764 627.8154 652.1899 682.0686 711.4502 751.9071 762.2084 783.4151 783.9935 839.2669 870.5829 959.7425 962.8168 984.4279 1006.2478 1010.6752 1045.2205 1113.0562 1155.9964 1163.9371 1180.4212 1192.6404 1201.8578 1274.7566 1320.3163 1339.9881 1380.0268 1410.5326 1418.4842 1453.9859 1465.9455 1540.1474 1577.7154 1599.2492 1628.3201 1650.9642 3124.4281 3137.9358 3143.2461 3166.1008 3183.8974 3211.1606 3565.2639 3702.5078
redmass: 12.8690 5.0480 3.2857 4.3118 8.1980 4.7084 4.1999 9.4680 1.3526 6.8712 1.9905 2.5384 6.1023 1.3992 4.4879 3.7700 5.5920 7.7558 3.2361 7.3628 5.9142 1.7757 8.6541 5.7044 2.4310 1.5144 1.5186 1.3782 3.7769 1.3315 2.3338 1.3332 2.4212 2.1003 2.0299 1.8454 1.3210 1.5027 3.6262 1.6727 2.6489 3.1854 4.2967 4.0898 3.6223 2.5389 3.3364 4.6498 5.8156 6.1178 6.4333 1.2308 1.0857 1.0905 1.0903 1.0988 1.0936 1.0935 1.0459 1.1026
irintensity: 0.0251 0.0602 3.3537 3.7666 2.2993 9.8868 1.8783 0.3306 7.4709 0.7424 70.8788 44.4950 1.1531 125.4668 0.4106 15.8467 7.1920 4.0708 3.1359 3.0447 6.2126 80.0880 3.0765 3.7688 42.4084 44.9124 4.0357 2.0439 10.7525 1.2870 0.1230 1.9922 14.0967 10.9670 15.2562 168.0964 13.0480 39.3047 486.0923 41.5681 63.0489 44.9879 3.9026 47.5169 5.4409 4.8510 37.7200 48.7103 12.7575 180.6095 25.5574 310.1447 6.8541 16.7318 19.8384 24.9255 3.6611 13.5280 119.8553 27.1656
temp: 298.150 k
press: 1.00000 atm
elementType: 8 8 7 7 6 6 6 6 6 6 6 6 6 6 1 1 1 1 1 1 1 1
symmnumber: 1
zpe: 428013.9 jmol-1
zpe.correction: 0.163022 hartree
zpe.thermalcorrener: 0.173297 hartree
zpe.thermalcorrenthalpy: 0.174242 hartree
zpe.thermalcorrgfe: 0.127198 hartree
zpe.sumelectzpe: -644.775253 hartree
zpe.sumelectthermal: -644.764978 hartree
zpe.sumelectthermalent: -644.764033 hartree
zpe.sumelectthermalfe: -644.811077 hartree
dipole: -8.5146 -2.8774 0.0067
dipole: 8.9877
quadrupole: -84.0154 -64.3343 -84.9047
quadrupole: 3.4220 0.0281 -0.0036
quadrupole: -6.2639 13.4172 -7.1532 3.4220 0.0281 -0.0036
hfenergy: -644.9382751 hartree
pointgroup: C01 [X(C10H8N2O2)]
dipole: 3.3203887 1.2159203 0.0026371 debye
dipolederiv: -1.1792669 0.1658996 -0.0000264 0.4350816 -0.4684915 -0.0002723 -0.0037194 0.0010477 -0.2543478 -0.6094823 -0.136305 -0.0000588 -0.4489173 -0.8880636 0.0012896 -0.0015484 -0.0012465 -0.2522183 2.2599165 0.2645767 0.0007387 0.3953089 1.1024919 -0.0009265 0.0044988 -0.0000701 0.1875873 -1.3662833 -0.7813692 0.0003904 -0.6135924 -0.5676645 -0.0000017 0.0013412 0.0006142 -0.6572873 0.3213953 -0.1210904 0.0000599 -0.3588968 0.1539865 -0.0000956 0.0003974 0.0002265 0.0642993 -0.0843214 0.0023008 -0.0000087 -0.4546743 -0.3547414 0.0001981 0.0004828 0.0001278 0.0020005 -1.0088173 -0.2408193 -0.0004751 -0.5641631 -0.4333796 0.0000104 0.0000114 0.0000633 -0.027226 1.5263208 0.8049 -0.0004617 0.3717369 0.6171566 -0.0001641 -0.0009939 -0.0004023 0.1457852 -0.1524108 0.1375642 -0.0001645 0.242945 -0.1402782 -0.000031 -0.0001311 0.0001392 -0.1454677 -0.0111273 -0.0634527 -0.0002134 0.1883684 0.0486436 -0.0001536 -0.000344 -0.0002241 -0.1679962 0.4148549 0.2985838 -0.0001511 0.6144501 0.3295645 0.0000622 0.0002232 -0.0002177 -0.0627929 -0.9039837 -0.3875128 0.000038 0.2386578 0.1157631 -0.0000471 0.0002336 0.0001813 -0.2412731 0.1567313 0.0589552 -0.0001124 0.0659038 0.2020528 -0.0001364 -0.0003263 -0.0001716 -0.1433237 0.0273024 -0.0713336 -0.0001858 -0.2064212 -0.1313877 0.0000853 -0.000087 0.0000643 -0.1529277 0.1032002 -0.1196849 0.0001388 0.0003679 0.1255546 0.0000109 0.000177 -0.0000308 0.1702672 -0.0822556 -0.066743 0.0001909 -0.1425073 0.0159695 0.0001248 0.0001804 0.0001026 0.150997 0.0722732 0.0669205 0.0001198 0.0162355 0.1013829 -0.0000464 0.0000458 0.0000511 0.1602292 0.0577213 -0.0539237 -0.000002 -0.0267224 -0.1229183 -0.0000526 -0.0001763 -0.0000676 0.1685158 0.090803 -0.0079235 0.0000384 0.0051869 -0.1180713 0.0000618 0.000008 0.0000764 0.1562788 -0.0689396 0.1058721 0.0001497 0.0934616 0.0309921 -0.0000429 0.0002232 -0.0000574 0.163141 0.1887487 0.0616209 0.0000089 0.1153597 0.2112106 0.0000043 -0.0000554 -0.0001644 0.3751512 0.2476207 0.0829644 -0.0000135 0.0328308 0.1702273 0.0001227 -0.0004409 -0.0000419 0.3606084 unknown
polarizability: 203.078151|3.0763743|177.7608931|-0.0027814|-0.0076069|49.7428957 unknown
InChI: InChI=1S/C10H8N2O2/c11-9-5-6-10(12(13)14)8-4-2-1-3-7(8)9/h1-6H,11H2
charge 0 multiplicity 1
22 atoms
O  -3.57755 0.686947 -0.002704
O  -2.81682 -1.449018 -0.000398
N  -2.598231 -0.168562 0.001906
N  2.547287 2.294438 -0.000486
C  -0.036121 -0.484542 0.000894
C  1.257298 0.18219 0.000087
C  -1.221888 0.350657 0.00133
C  1.330903 1.636097 0.000142
C  -0.045707 -1.920791 0.001034
C  2.449565 -0.608546 -0.000713
C  -1.114012 1.752919 0.00114
C  0.135639 2.390921 0.000684
C  1.141211 -2.657802 0.000428
C  2.403933 -2.003783 -0.000495
H  -1.01056 -2.425407 0.001731
H  3.434385 -0.127677 -0.001683
H  -2.037826 2.336508 0.001438
H  0.184673 3.485453 0.00081
H  1.09317 -3.751896 0.000669
H  3.329906 -2.587472 -0.001106
H  2.574063 3.31101 -0.000531
H  3.43318 1.799657 0.000023
