program: Gaussian 09
title: 000168617
version: EM64L-G09RevD.01
frameworkgroup: C1[X(C20H20O7)]
method: RPBEPBE
basis: SDD
operation: Freq
keyword: #pfreq=noraman
keyword: PBEPBE/SDD
title: #p freq=noraman PBEPBE/SDD
converged: YES YES NO NO
title: Mulliken charges:
elementType: O O O O O O O C C C C C C C C C C C C C C C C C C C C H H H H H H H H H H H H H H H H H H H H
charge: -0.221359 -0.437305 -0.148020 -0.358490 -0.335562 -0.410917 -0.359202 0.272087 -0.119984 -0.063402 0.189657 -0.775985 -0.758511 -0.072164 0.089952 0.342479 0.128995 -0.722710 0.441947 0.038920 -0.117654 -0.642566 0.095825 0.014716 -0.036077 -0.813410 -0.511294 0.240011 0.201339 0.264518 0.253771 0.229431 0.280796 0.216326 0.274134 0.229005 0.226822 0.367679 0.267105 0.245879 0.239472 0.243276 0.388244 0.387135 0.215124 0.288073 0.231895
chargesum: 0.00000
title: Mulliken charges with hydrogens summed into heavy atoms:
elementType: O O O O O O O C C C C C C C C C C C C C C C C C C C C
charge: -0.221359 -0.069626 -0.148020 0.029754 -0.335562 -0.023782 -0.359202 0.272087 -0.119984 0.176609 0.189657 -0.056357 -0.031958 -0.072164 0.089952 0.342479 0.128995 0.007250 0.441947 0.038920 -0.117654 -0.375462 0.095825 0.014716 -0.036077 -0.084783 0.223798
polarizability: 3.90287393e+02 1.63371594e+01 2.84234642e+02 1.68344214e+00 2.36660396e-02 1.39911401e+02
1716.lowfreq: -9.2111 -3.4808 -2.6835 -0.0001 0.0003 0.0008 33.4958 44.1735 65.9131
frequency: 33.3773 44.1662 65.9121 73.2589 109.0587 113.4981 122.6762 133.9918 150.9870 162.0197 187.7846 196.8397 206.3310 212.9366 220.7520 224.6759 225.7356 243.3621 248.8153 265.2565 272.6266 282.4193 289.0048 298.2526 314.6024 322.9909 324.6726 336.7749 340.2185 362.4962 368.9946 390.4035 402.4454 426.3366 433.0812 441.3778 474.5413 495.8015 525.6165 535.5662 575.7404 578.3811 597.2202 611.6836 628.9871 652.6370 657.6452 667.4874 678.8983 717.9733 722.8962 742.2311 770.8672 791.3679 799.1179 811.7787 851.0692 879.4940 884.8823 893.4551 912.7044 950.3373 961.6539 1003.8140 1010.4116 1017.8291 1029.8866 1044.4563 1046.6527 1068.1232 1087.1162 1111.4097 1115.1464 1119.8423 1121.5111 1135.6826 1164.1728 1174.8575 1191.4367 1201.0911 1208.2382 1226.6142 1239.4095 1260.2356 1268.0530 1298.4845 1313.9987 1336.7131 1350.6977 1359.6116 1379.4694 1389.6832 1392.5654 1399.9140 1401.9816 1417.0133 1420.0085 1441.8807 1453.8356 1454.7529 1456.0134 1459.4623 1465.5985 1469.6919 1473.3302 1480.1796 1483.5314 1487.8409 1503.2702 1522.7344 1556.4062 1572.2169 1598.2402 1603.3548 1646.4467 2111.0096 2982.5412 2986.4347 2991.3225 2992.1966 2998.1332 3043.5592 3070.4432 3071.3105 3088.9968 3089.7645 3100.8758 3101.2522 3114.0097 3119.5540 3121.2433 3143.5298 3161.8820 3366.6822 3518.1805
redmass: 4.9112 5.3055 3.3319 3.9582 4.4472 3.2326 3.1455 4.0368 2.8247 2.2223 2.8487 5.5020 1.7901 3.7991 1.2817 1.6405 2.3586 1.2712 2.1223 1.2277 3.6209 1.3638 4.7573 4.0550 4.5994 5.4337 4.1043 5.9035 4.2523 5.2975 4.9801 8.1860 5.4711 4.3295 4.1069 5.9440 4.9308 4.0500 8.0561 4.3405 5.6108 6.2538 5.6735 7.4318 6.0111 2.9872 2.4630 2.6282 4.5030 5.3235 7.9923 6.3590 5.3101 6.5881 3.7794 4.8451 5.4355 1.4467 6.2527 5.0367 4.3639 1.5974 1.9996 1.5116 2.4189 2.2477 1.7553 1.6037 1.5822 4.0367 5.3703 1.0824 3.2565 1.2786 2.5369 2.5787 1.9230 2.6885 2.1129 2.9464 2.1922 3.1146 2.6032 4.0256 1.8349 2.1492 2.1913 1.4059 4.8877 3.4163 1.1939 2.9313 1.3570 1.2291 1.3365 5.2888 3.0093 1.7434 1.2475 1.0963 1.1755 1.0482 1.0783 2.2553 1.0632 1.0727 1.0563 1.0747 1.0584 3.4221 6.7635 7.9341 5.1798 10.0900 3.9230 1.0895 1.0377 1.0341 1.0369 1.0393 1.0363 1.0880 1.0989 1.0959 1.0976 1.0968 1.1009 1.0981 1.0983 1.1007 1.0997 1.1062 1.0923 1.0629 1.0664
irintensity: 1.1210 0.9487 5.4382 0.3080 2.0239 0.8848 0.5244 1.8433 2.4348 0.8404 1.1174 3.1739 0.4303 4.9487 0.2565 1.2416 2.4426 1.4847 2.7574 66.2416 0.6159 2.6045 12.3646 5.4527 11.5732 0.2792 6.1654 8.6309 1.2959 2.7349 12.6227 12.1583 7.2145 39.0747 2.6830 9.9575 9.6534 0.2201 13.0478 41.6608 0.8403 9.5157 6.0973 1.4288 13.4483 57.9616 57.1544 40.7902 21.4055 16.2066 11.4319 0.2514 22.5779 25.6142 7.1671 62.9849 10.4254 19.6433 68.0407 8.7424 31.5040 9.9903 11.4686 42.5258 4.9382 8.6529 126.6669 21.8648 9.0361 26.7830 39.7277 125.5164 86.9412 26.0670 11.1466 118.3420 102.1529 69.6220 75.9048 30.2745 84.9810 27.5195 186.0242 132.6657 194.7665 12.0248 20.2682 16.9888 102.6470 22.3677 15.5082 78.3152 36.1422 83.3861 35.5517 25.0452 327.3860 311.4847 8.1307 12.0432 54.1058 16.1794 30.4485 81.2394 5.8835 20.4739 23.6674 17.1918 25.7241 33.1601 290.1495 58.4966 214.0557 405.8840 311.0994 476.9270 19.9213 88.9716 10.3342 31.2705 27.5207 24.2703 43.7352 9.4056 13.1336 21.6040 22.2340 32.4663 3.1787 11.3905 11.7942 7.6417 5.6646 137.9821 11.2792
temp: 298.150 k
press: 1.00000 atm
elementType: 8 8 8 8 8 8 8 6 6 6 6 6 6 6 6 6 6 6 6 6 6 6 6 6 6 6 6 1 1 1 1 1 1 1 1 1 1 1 1 1 1 1 1 1 1 1 1
symmnumber: 1
zpe: 944009.2 jmol-1
zpe.correction: 0.359554 hartree
zpe.thermalcorrener: 0.384744 hartree
zpe.thermalcorrenthalpy: 0.385688 hartree
zpe.thermalcorrgfe: 0.307410 hartree
zpe.sumelectzpe: -1298.729664 hartree
zpe.sumelectthermal: -1298.704474 hartree
zpe.sumelectthermalent: -1298.703530 hartree
zpe.sumelectthermalfe: -1298.781808 hartree
dipole: -3.9173 0.5522 1.7643
dipole: 4.3316
quadrupole: -139.8448 -167.3380 -155.9753
quadrupole: -20.2461 9.4090 -4.4070
quadrupole: 14.5412 -12.9520 -1.5892 -20.2461 9.4090 -4.4070
hfenergy: -1299.0892182 hartree
pointgroup: C01 [X(C20H20O7)]
dipole: 1.5582071 -0.2548371 0.6413336 debye
polarizability: 390.6637871|13.3759277|283.4184493|-10.5865726|-1.3420947|140.3511997 unknown
InChI: InChI=1S/C20H20O7/c1-7-6-9(21)11-12-10(7)18-20(25,19(3,4)8(2)27-18)17(24)13(12)15(23)16(26-5)14(11)22/h6,8,22-23,25H,1-5H3
charge 0 multiplicity 1
47 atoms
O  2.987336 -1.371939 -0.180513
O  2.165781 0.960832 1.667563
O  1.094554 2.858523 -0.660304
O  -1.566061 3.258587 -0.073204
O  -3.97722 2.278191 0.049994
O  -4.355484 -0.644495 0.116626
O  -3.350586 -2.87523 0.090389
C  3.4438 1.007203 -0.44908
C  2.035534 0.773161 0.184614
C  4.144855 -0.360721 -0.142582
C  1.796116 -0.705193 -0.042187
C  4.187641 2.226693 0.12838
C  3.302427 1.146199 -1.991375
C  0.864201 1.680372 -0.261434
C  0.533535 -1.291342 -0.060354
C  -0.621931 -0.365453 -0.011175
C  -0.467307 1.071919 -0.081795
C  4.87509 -0.528842 1.189183
C  0.312708 -2.739308 -0.100922
C  -1.93061 -0.922964 0.04995
C  -1.647622 1.880566 -0.041894
C  -0.981295 -3.234524 -0.050269
C  -2.133326 -2.372913 0.035517
C  -3.111451 -0.08358 0.079344
C  -2.947604 1.315427 0.06413
C  1.467902 -3.716583 -0.177941
C  -5.12916 2.08258 0.963442
H  4.783629 -0.678312 -0.985544
H  5.209317 2.284738 -0.291713
H  3.643934 3.145723 -0.145032
H  4.253754 2.182679 1.226229
H  2.783435 0.27951 -2.442905
H  2.741676 2.058879 -2.245347
H  4.306423 1.215844 -2.447983
H  4.23496 -0.22521 2.031927
H  5.181807 -1.581235 1.320117
H  5.787487 0.094103 1.194484
H  1.253768 0.982244 2.063144
H  -1.172808 -4.311512 -0.068646
H  2.075013 -3.554604 -1.086221
H  1.092269 -4.752432 -0.182788
H  2.160882 -3.594251 0.67355
H  -2.508877 3.598953 -0.027372
H  -4.181775 -1.723163 0.115907
H  -4.786254 2.086074 2.015324
H  -5.632991 1.132483 0.731923
H  -5.789073 2.941921 0.77314
