program: Gaussian 09
title: 000168193
version: EM64L-G09RevD.01
frameworkgroup: C1[X(C10H8N2O)]
method: RPBEPBE
basis: SDD
operation: Freq
keyword: #p
keyword: freq=noraman
keyword: PBEPBE/SDD
title: #p freq=noraman PBEPBE/SDD
converged: NO YES NO NO
title: Mulliken charges:
elementType: O N N C C C C C C C C C C H H H H H H H H
charge: -0.182741 -0.120053 -0.058424 0.484015 -0.267738 -0.372394 -0.388162 -0.278246 -0.234683 -0.233037 -0.234493 0.081449 -0.134298 0.253279 0.229399 0.235254 0.248093 0.230106 0.231677 0.233479 0.277518
chargesum: 0.00000
title: Mulliken charges with hydrogens summed into heavy atoms:
elementType: O N N C C C C C C C C C C
charge: -0.182741 -0.120053 -0.058424 0.484015 -0.014459 -0.142996 -0.152908 -0.030153 -0.004577 -0.001360 -0.001014 0.081449 0.143221
polarizability: 2.59460766e+02 -5.20887350e+00 1.15730141e+02 5.94994350e-02 2.79255962e-02 4.89830421e+01
1716.lowfreq: -4.9829 -0.0011 -0.0008 -0.0005 2.8521 5.8911 36.2004 64.8157 76.6602
frequency: 36.1442 64.8065 76.6563 114.4797 195.2690 250.7382 298.3193 327.1329 402.6393 469.1159 496.6576 572.5820 576.6475 615.1618 690.9146 710.5170 735.6365 774.7777 808.6653 829.0668 845.4943 846.1431 882.9479 905.0640 926.4292 949.2875 975.3056 979.5275 988.2801 993.8874 1005.8573 1025.7104 1084.7783 1167.3547 1175.1941 1193.4664 1220.8791 1230.9467 1302.5471 1324.0692 1344.9612 1387.1497 1425.0824 1447.7947 1455.0487 1489.8313 1582.4018 1609.9857 1650.5737 3106.0367 3124.2828 3129.2534 3141.5014 3151.1362 3154.5619 3168.1368 3263.9544
redmass: 5.6667 5.5351 5.5955 3.5154 6.8188 2.4323 6.5065 5.1354 2.7680 4.7280 3.1510 4.1663 6.8524 6.4424 2.1286 2.9493 6.5605 2.0246 8.8782 1.4239 5.0296 1.2932 1.8450 11.6804 1.4651 5.6936 5.5704 1.3853 6.1574 1.2581 1.2398 2.2011 1.6183 2.1502 1.1199 1.1563 1.8456 1.5585 1.4410 1.8802 1.5181 5.8472 4.0957 2.7591 7.1635 2.5490 5.6805 5.8857 5.7915 1.0913 1.0866 1.0867 1.0915 1.0939 1.0921 1.1016 1.1011
irintensity: 0.9001 0.7512 0.3218 1.2971 1.4119 0.0272 1.7300 2.1859 0.0370 8.1380 10.8182 13.2858 19.7849 0.0731 40.9882 10.1971 32.9686 61.7505 20.5204 23.3011 6.1434 0.3892 5.9060 4.6440 0.0011 6.1864 34.1582 0.5772 0.8308 23.7251 31.5252 3.2328 9.0544 6.4851 2.1444 7.3660 17.3819 33.1534 1.0490 5.2055 14.6353 2.8833 21.9255 17.5171 120.5433 38.8200 6.5836 3.0776 118.5183 4.4072 6.1230 1.0751 10.2502 19.0933 24.1813 29.6015 1.4827
temp: 298.150 k
press: 1.00000 atm
elementType: 8 7 7 6 6 6 6 6 6 6 6 6 6 1 1 1 1 1 1 1 1
symmnumber: 1
zpe: 410922.0 jmol-1
zpe.correction: 0.156512 hartree
zpe.thermalcorrener: 0.166948 hartree
zpe.thermalcorrenthalpy: 0.167892 hartree
zpe.thermalcorrgfe: 0.118727 hartree
zpe.sumelectzpe: -569.623717 hartree
zpe.sumelectthermal: -569.613281 hartree
zpe.sumelectthermalent: -569.612337 hartree
zpe.sumelectthermalfe: -569.661502 hartree
dipole: 1.7220 1.0730 -0.0075
dipole: 2.0289
quadrupole: -58.0129 -74.0859 -79.6191
quadrupole: -5.5957 0.0493 0.0517
quadrupole: 12.5597 -3.5133 -9.0465 -5.5957 0.0493 0.0517
hfenergy: -569.7802287 hartree
pointgroup: C01 [X(C10H8N2O1)]
dipole: -0.6739571 0.4270654 -0.0244232 debye
dipolederiv: -1.0037537 0.1425324 -0.0118627 -0.0376292 -0.4432678 0.0191515 -0.0018186 0.017516 -0.0862306 -0.8442395 0.0899087 -0.0077179 -0.1249632 -0.3407309 0.0048178 0.0036152 0.0071059 -0.2222534 0.1797597 -0.0958316 0.0057666 0.340951 -0.1829084 0.0029376 -0.0177253 0.0018908 -0.1493131 -0.1553259 0.0372636 -0.0033473 0.0977814 -0.0432923 0.0052309 -0.0078944 0.0048092 0.0377727 0.7681876 -0.0284692 0.0062544 0.0489453 0.1150783 -0.0122527 0.0034386 -0.0121771 -0.0974026 -0.0235557 0.0748338 -0.0033138 -0.0614041 0.0121239 -0.0088838 0.0049902 -0.008162 -0.1405175 -0.0172604 -0.1061645 0.0072161 0.0764728 0.0642718 -0.0131731 -0.0032963 -0.0140728 -0.1667561 -0.8163996 -0.0154312 -0.0023932 -0.452499 0.0988938 -0.0179618 0.0218689 -0.0159913 -0.1705709 -0.1599212 -0.0902454 0.0052561 -0.2086577 0.1139446 -0.0160557 0.0120549 -0.0154714 -0.1443562 -0.0033834 0.138513 -0.0070659 0.2372259 0.036786 -0.0090595 -0.0125498 -0.0094759 -0.1437722 0.0236667 -0.0229965 0.0026818 0.0363345 -0.0253138 -0.0074565 -0.0011365 -0.0077553 -0.1566796 1.4708443 0.0632046 0.0040138 -0.0463144 0.1088886 -0.0003933 0.0111134 -0.0000566 0.0948395 0.3984318 -0.1972855 0.0123695 -0.024579 0.5614271 -0.0266323 0.001528 -0.0277179 0.0418634 0.0618235 0.0097438 -0.0010949 0.0816681 -0.0405816 0.0115938 -0.0055399 0.0110723 0.1503166 0.0259031 -0.1095023 0.0054062 -0.0757498 -0.0168137 0.0087696 0.0034257 0.0085958 0.1450609 0.0618441 0.0932146 -0.0060059 0.0577854 -0.0623753 0.0129988 -0.0039031 0.0131254 0.1545801 0.0680841 0.0293167 -0.0022458 0.0807438 -0.0289941 0.0118961 -0.0062133 0.0116749 0.169151 0.03576 0.0642835 -0.0044798 0.1029516 -0.0887656 0.0148076 -0.0067607 0.0145257 0.1573036 -0.0180006 -0.0966171 0.0044408 -0.1255678 -0.0384461 0.0107093 0.0060274 0.0108612 0.1599419 -0.1289429 0.0286591 -0.0035265 0.0334417 0.0874905 0.0045404 -0.0037316 0.0045196 0.1623131 0.0764781 -0.0089305 -0.0003514 -0.0369374 0.112585 0.0044156 0.0025071 0.0051835 0.2047095 unknown
polarizability: 259.5308209|4.0754751|115.4460315|0.9387908|-3.7146488|49.1970969 unknown
InChI: InChI=1S/C10H8N2O/c1-2-4-9(5-3-1)6-7-10-11-8-13-12-10/h1-8H
charge 0 multiplicity 1
21 atoms
O  4.271509 -0.901299 0.087939
N  3.30978 1.160859 -0.023344
N  2.81219 -1.121102 0.093792
C  -1.555246 -0.173534 0.024153
C  -0.112506 -0.445508 0.047608
C  -2.103967 1.140926 -0.054694
C  -2.45517 -1.277281 0.082463
C  0.897474 0.47988 -0.000932
C  -3.49769 1.337447 -0.075278
C  -3.851288 -1.080264 0.061886
C  -4.379271 0.229047 -0.017374
C  2.313065 0.145353 0.025095
C  4.444035 0.485929 0.020873
H  0.173547 -1.505337 0.110078
H  -1.440005 2.011112 -0.099964
H  -2.048441 -2.29422 0.143987
H  0.698774 1.554824 -0.063991
H  -3.903234 2.353417 -0.136273
H  -4.525422 -1.942436 0.1072
H  -5.463194 0.387016 -0.033503
H  5.464563 0.859169 0.006581
