program: Gaussian 09
title: 000013052
version: EM64L-G09RevD.01
frameworkgroup: C1[X(C9H11NO3)]
method: RPBEPBE
basis: SDD
operation: Freq
keyword: #p
keyword: freq=noraman
keyword: PBEPBE/SDD
title: #p freq=noraman PBEPBE/SDD
converged: YES YES NO NO
title: Mulliken charges:
elementType: O O O N C C C C C C C C C H H H H H H H H H H H
charge: -0.412302 -0.441330 -0.257341 -0.551577 -0.580003 -0.204983 0.538478 -0.577139 -0.450413 0.190483 0.301677 -0.189079 -0.368223 0.221905 0.240050 0.272698 0.256126 0.234866 0.280727 0.289260 0.224721 0.251993 0.374069 0.355339
chargesum: 0.00000
title: Mulliken charges with hydrogens summed into heavy atoms:
elementType: O O O N C C C C C C C C C
charge: -0.038233 -0.085991 -0.257341 0.018409 -0.118048 0.067715 0.538478 -0.321014 -0.215547 0.190483 0.301677 0.035642 -0.116230
polarizability: 1.30156962e+02 1.14253205e+01 1.19128503e+02 1.28422250e+01 -1.02670334e+01 8.39562812e+01
1716.lowfreq: -4.9759 -0.0003 0.0002 0.0005 3.6247 8.6677 31.0956 37.4793 69.6838
frequency: 31.0289 37.4642 69.6729 88.2400 174.5810 223.1838 238.7470 248.7996 290.9652 296.7681 341.9786 374.0836 422.8039 436.4650 471.8292 517.3253 557.1075 578.4211 596.6068 623.9439 634.2787 696.4689 706.6374 748.6648 777.9634 799.6969 870.9954 891.5931 917.0031 971.2035 974.0650 985.5149 991.0985 1046.3486 1075.3575 1097.1006 1130.2865 1142.4939 1172.3551 1184.0243 1207.3281 1244.1560 1276.0533 1315.5718 1323.9768 1343.9171 1365.0837 1394.8414 1442.0637 1464.5245 1495.9323 1611.7801 1614.7818 1636.4154 1646.1953 3000.4001 3059.8422 3075.3676 3114.6214 3125.3152 3147.3711 3174.0779 3456.1790 3498.5756 3578.2219 3588.8383
redmass: 5.2977 7.0585 7.1192 4.2866 5.7843 4.2820 4.7714 2.9985 3.0914 1.6331 1.9802 1.1218 3.2309 3.2617 3.2465 7.5462 4.0079 2.4911 1.5965 2.7547 1.6816 2.2796 4.0279 4.0580 3.0727 1.6792 1.5331 1.4400 2.3883 1.7962 1.5628 5.9203 2.7473 2.2047 1.6264 3.2685 1.4244 1.3463 1.1019 1.3689 1.4201 1.5657 2.8674 1.4068 1.4427 1.6176 1.3570 6.3743 2.7832 1.1098 2.6013 6.1334 6.3874 1.1171 6.9760 1.0615 1.0896 1.0973 1.0917 1.0873 1.0936 1.0971 1.0446 1.0639 1.0659 1.0987
irintensity: 1.1656 0.9822 1.2901 0.1711 1.4989 0.4880 3.6041 8.0699 1.5494 28.0961 17.2148 141.7382 15.9679 1.7895 54.2458 2.3701 8.2654 77.9787 160.2579 83.9003 88.7112 39.8170 25.6311 17.8283 15.6800 25.1880 27.5386 4.3557 9.7775 11.6066 12.3493 4.2845 49.6297 216.0174 36.0081 22.3361 74.4695 120.9742 3.4037 12.5161 15.0554 7.3428 16.9019 7.3741 7.2803 7.2707 10.3531 10.0432 57.9488 13.5206 11.9123 95.9730 19.4073 49.4447 166.6957 20.0493 5.1226 15.6427 6.8059 6.9608 18.5074 10.1951 3.9446 17.7791 31.9433 5.0776
temp: 298.150 k
press: 1.00000 atm
elementType: 8 8 8 7 6 6 6 6 6 6 6 6 6 1 1 1 1 1 1 1 1 1 1 1
symmnumber: 1
zpe: 494264.6 jmol-1
zpe.correction: 0.188255 hartree
zpe.thermalcorrener: 0.200973 hartree
zpe.thermalcorrenthalpy: 0.201917 hartree
zpe.thermalcorrgfe: 0.148127 hartree
zpe.sumelectzpe: -629.010436 hartree
zpe.sumelectthermal: -628.997718 hartree
zpe.sumelectthermalent: -628.996774 hartree
zpe.sumelectthermalfe: -629.050565 hartree
dipole: -2.5369 0.3216 0.4111
dipole: 2.5900
quadrupole: -73.6220 -72.1935 -75.7794
quadrupole: -3.5954 -0.8258 -0.7446
quadrupole: 0.2430 1.6715 -1.9144 -3.5954 -0.8258 -0.7446
hfenergy: -629.1986913 hartree
pointgroup: C01 [X(C9H11N1O3)]
dipole: -0.9919678 0.0845348 0.2172721 debye
dipolederiv: -0.4263917 0.0500809 0.1764351 0.0929914 -0.3084995 -0.3162645 0.2105868 -0.2788455 -1.1271961 -0.3602544 -0.4103238 0.2227114 -0.5023004 -1.1856599 0.1617801 0.2379909 0.1587246 -0.4067299 -0.4061886 0.1141863 0.0400538 -0.0571343 -0.7815876 0.265452 0.2293832 0.094653 -0.7587601 -0.6460144 -0.0898829 -0.040889 -0.1709114 -0.8408759 -0.158376 0.0044477 -0.149642 -0.2025337 -0.0759269 -0.0147227 0.0173574 0.0214432 0.0681883 -0.0459167 0.1222912 0.0058941 0.1140512 0.5378243 -0.0279729 0.0259361 -0.0010899 0.2312305 0.0195237 -0.0750911 0.002738 0.1096293 0.335689 0.0644332 0.0535717 0.0008721 0.1347644 -0.0937244 0.1436238 -0.0702113 -0.0135485 -0.287818 -0.2880291 0.1256173 -0.0756822 -0.2348219 0.011497 0.011032 -0.0861653 -0.1660078 -0.3176609 0.0360346 -0.0160106 0.0759879 -0.0585214 -0.0231166 -0.0611453 -0.0441229 -0.2000971 0.1843373 -0.0789618 -0.2270392 -0.0988034 0.978694 0.0253524 -0.413734 0.1511312 1.440378 0.3038763 0.4050547 -0.1024689 0.5085275 1.1275307 -0.2843103 -0.1216099 -0.2658848 0.1682495 0.158206 0.0161901 0.1023424 0.0925488 0.1341593 -0.0728567 0.0794414 -0.0994779 -0.0536562 -0.0128658 0.1284032 0.0376592 -0.1334596 -0.3150401 0.0095863 0.1302729 0.1004809 -0.181303 0.0042153 -0.0049847 -0.0497323 0.0239111 0.0516969 0.1182317 -0.0625377 0.0410024 -0.0547751 0.0349481 0.0006599 -0.009288 -0.0234203 -0.0950483 -0.0546404 -0.002609 -0.0247297 0.0720921 0.0522559 0.0088585 -0.0368246 0.0024083 0.0270897 0.0468468 -0.0620174 0.0421134 -0.0557039 0.1043748 0.0369366 -0.0767118 0.0375138 -0.0065137 0.0767037 -0.0762268 0.073282 0.1086108 0.0623783 -0.1034927 -0.0071205 -0.0865985 -0.0566434 0.0537676 -0.0137761 0.0453347 0.1277169 0.1726913 -0.0084613 -0.010573 0.0325639 0.2450008 0.1737442 -0.0336097 0.1132065 0.133054 0.0562893 0.0202699 0.0456295 0.1200892 0.350369 -0.0616222 0.0396243 -0.0335969 0.0973933 0.0185154 0.0699811 -0.0759247 0.0779989 -0.0019365 0.09062 -0.08666 0.0905248 0.0825034 -0.0437502 -0.0485831 -0.0644761 -0.0554107 0.0981072 0.0096485 -0.0681136 0.0122738 0.1445661 0.3934292 0.0156878 0.0106485 0.0331667 0.0799858 0.019404 -0.0025097 0.0789565 0.3126302 0.1578402 0.1086382 -0.1409038 0.0847879 0.3583315 0.0286698 -0.1290541 0.0423604 0.3094366 unknown
polarizability: 130.3886767|11.7377466|119.4576368|10.1669881|-11.7136798|83.3954326 unknown
InChI: InChI=1S/C9H11NO3/c10-8(9(12)13)5-6-2-1-3-7(11)4-6/h1-4,8,11-12H,5,10H2
charge 0 multiplicity 1
24 atoms
O  -2.362545 1.134974 1.751559
O  2.940583 2.075899 -0.614914
O  -2.039267 1.705235 -0.47819
N  -3.358214 -1.205724 -0.201101
C  -0.972418 -1.065249 -0.877615
C  -2.027676 -0.70048 0.197671
C  0.454618 -0.737716 -0.459656
C  1.019583 0.527231 -0.758575
C  1.230738 -1.685931 0.254671
C  -2.099931 0.822037 0.40987
C  2.336723 0.833887 -0.343744
C  2.547437 -1.368173 0.662366
C  3.111278 -0.109455 0.368583
H  -1.23266 -0.533044 -1.812839
H  -1.085549 -2.148194 -1.061543
H  -1.755755 -1.167967 1.158501
H  0.421862 1.267107 -1.308124
H  0.808306 -2.671906 0.481469
H  -3.700328 -0.822938 -1.089047
H  -4.06457 -1.181886 0.540547
H  3.143043 -2.107575 1.20928
H  4.128354 0.154027 0.672977
H  -2.470308 2.120803 1.849127
H  2.317596 2.666038 -1.107775
