program: Gaussian 09
title: 000168131
version: EM64L-G09RevD.01
frameworkgroup: C1[X(C17H19N2)]
method: RPBEPBE
basis: SDD
operation: Freq
keyword: #p
keyword: freq=noraman
keyword: PBEPBE/SDD
title: #p freq=noraman PBEPBE/SDD
converged: YES YES NO NO
title: Mulliken charges:
elementType: N N C C C C C C C C C C C C C C C C C H H H H H H H H H H H H H H H H H H H
charge: -0.112142 -0.019276 0.168757 0.289716 0.087588 0.400564 -0.245565 0.108977 -0.388203 0.448884 -0.382701 -0.451715 -0.827713 -0.822046 0.447424 -0.542957 -0.493197 -0.791986 -0.789342 0.293834 0.275260 0.282823 0.249495 0.248721 0.248825 0.254415 0.254265 0.244182 0.285634 0.286403 0.212451 0.272836 0.259211 0.239696 0.260698 0.247758 0.257763 0.240664
chargesum: 1.00000
title: Mulliken charges with hydrogens summed into heavy atoms:
elementType: N N C C C C C C C C C C C C C C C C C
charge: -0.112142 -0.019276 0.168757 0.289716 0.087588 0.400564 -0.245565 0.108977 -0.094369 0.448884 -0.107441 -0.168891 -0.080672 -0.069184 0.447424 0.241531 -0.220361 -0.032382 -0.043156
polarizability: 3.36411950e+02 4.59621535e+00 2.20541963e+02 -5.96637222e-01 -6.57982612e-03 9.52263508e+01
1716.lowfreq: -8.7499 -4.9719 -0.0009 -0.0009 -0.0007 7.9668 22.4229 28.5239 44.5173
frequency: 22.2630 28.2362 44.4731 49.0653 76.2190 128.1988 150.6724 172.4595 172.9517 186.2297 210.9574 222.9832 239.6897 264.1731 294.9737 337.5997 345.9135 352.4652 391.4288 403.5616 413.1152 439.0842 453.1464 480.1829 496.0365 526.4327 553.3884 559.3337 579.3005 610.2882 642.3438 670.2672 673.9228 706.1557 734.7460 828.2358 833.8908 880.6466 898.8111 934.8943 947.8749 953.9487 956.4535 983.3508 1002.8331 1016.5555 1018.7304 1026.4176 1051.1935 1053.5347 1055.0620 1063.4204 1086.5565 1098.8201 1118.9945 1135.3998 1178.1147 1217.2078 1241.2619 1274.1885 1285.2534 1332.1566 1343.7768 1348.2832 1372.2129 1393.7241 1396.3213 1405.2682 1408.6903 1410.1288 1422.6559 1434.0751 1436.5600 1442.1597 1445.8225 1462.7840 1465.8388 1466.3164 1470.0053 1476.0890 1478.7324 1483.3937 1489.1281 1495.1552 1519.1781 1558.9264 1600.8970 1603.9794 1614.5683 2986.7842 2987.5843 2992.2507 2995.3311 3038.3550 3056.3613 3060.7003 3068.7827 3078.6379 3102.4228 3104.2093 3127.3633 3136.6830 3150.0444 3150.1976 3162.2838 3169.1268 3181.9556 3189.5947
redmass: 2.9265 1.0426 1.1216 2.7972 2.8743 3.1718 1.5621 2.6014 1.8902 1.6190 1.5217 1.1507 2.7729 3.4084 4.4615 2.9713 3.5923 3.5929 4.7117 4.1551 2.9787 4.2276 4.0887 4.8598 3.5708 4.7638 4.8967 2.5758 3.7046 3.8411 4.5669 3.9244 4.7590 5.3585 4.0158 4.3550 5.0784 1.4655 1.4161 3.4695 1.3815 1.3845 3.1210 2.1281 1.5624 2.8872 1.8471 1.4646 1.6220 1.5872 1.6424 2.5332 1.7393 2.4579 1.3657 2.8618 2.9489 2.1730 1.9167 2.8746 3.3801 2.2096 3.1815 3.3862 4.5018 2.0088 1.3017 1.2290 1.2914 1.2386 2.4085 2.1016 3.9438 1.0417 1.2789 1.1867 1.0785 1.0734 1.1099 1.0431 1.2575 1.2307 1.0440 1.2423 3.7974 5.0567 5.7069 4.5665 5.6036 1.0433 1.0389 1.0435 1.0380 1.0345 1.0976 1.0969 1.0959 1.0981 1.0997 1.0996 1.0926 1.0949 1.0919 1.1000 1.1023 1.0919 1.0915 1.0944
irintensity: 0.0827 1.1975 1.1270 1.1699 3.0524 3.0082 0.1852 2.4058 3.2947 0.1490 0.0194 0.1828 0.0403 0.1975 1.4942 0.4393 0.1295 1.1273 0.0040 0.7591 0.9085 0.1699 0.4660 4.3348 2.0248 0.0363 1.7064 0.5154 12.4154 0.2939 0.6066 0.2671 0.5554 10.3887 8.6684 3.3432 0.0107 17.5010 14.2232 3.9051 1.6102 0.1106 7.1239 8.8729 9.0225 2.3837 4.1767 2.2505 7.7156 20.1935 0.9032 3.0502 5.4149 2.5312 1.5174 4.8972 2.5186 10.0069 8.3339 0.3275 0.9411 19.6789 29.6270 0.6842 3.5189 22.8437 2.3875 27.6364 18.4684 28.4849 22.6502 47.2979 2.3425 19.0283 36.5754 27.2452 7.9837 34.4685 5.8037 2.1065 48.0325 1.8725 30.1919 50.3608 47.6838 7.7566 74.5631 11.6473 52.7251 13.2765 3.0782 5.0565 5.2097 16.4688 8.3207 8.0245 8.6229 4.4976 11.1313 10.1368 12.7740 1.6022 36.2408 2.9418 0.4703 4.4106 0.8399 0.0006
temp: 298.150 k
press: 1.00000 atm
elementType: 7 7 6 6 6 6 6 6 6 6 6 6 6 6 6 6 6 6 6 1 1 1 1 1 1 1 1 1 1 1 1 1 1 1 1 1 1 1
symmnumber: 1
zpe: 833135.7 jmol-1
zpe.correction: 0.317325 hartree
zpe.thermalcorrener: 0.335567 hartree
zpe.thermalcorrenthalpy: 0.336511 hartree
zpe.thermalcorrgfe: 0.269944 hartree
zpe.sumelectzpe: -767.170343 hartree
zpe.sumelectthermal: -767.152101 hartree
zpe.sumelectthermalent: -767.151157 hartree
zpe.sumelectthermalfe: -767.217724 hartree
dipole: 2.5537 -0.7793 0.0567
dipole: 2.6706
quadrupole: -47.3507 -77.5535 -112.8416
quadrupole: -4.0147 -0.2990 -0.0710
quadrupole: 31.8979 1.6951 -33.5930 -4.0147 -0.2990 -0.0710
hfenergy: -767.487668 hartree
pointgroup: C01 [X(C17H19N2)]
dipole: -1.0008915 -0.3191952 -0.0168136 debye
polarizability: 336.4931137|-3.129777|220.4439573|-2.0778357|0.2571135|95.2431925 unknown
InChI: InChI=1S/C17H19N2/c1-10-6-14-12(3)13(4)15-7-11(2)9-19(5)17(15)16(14)18-8-10/h6-9H,1-5H3
charge 1 multiplicity 1
38 atoms
N  -1.468373 -1.69944 0.004447
N  1.448641 -1.784337 -0.003122
C  -0.668985 -0.543578 0.003735
C  -1.338208 0.740258 0.009891
C  -0.584071 1.994451 0.007646
C  1.501873 0.678735 -0.005019
C  0.78658 -0.574113 -0.002725
C  0.812475 1.966598 0.000384
C  -2.761428 0.77232 0.018254
C  -3.537738 -0.399411 0.021249
C  -2.838456 -1.61874 0.013123
C  2.930406 0.604995 -0.011287
C  -1.385919 3.285214 0.013449
C  1.673282 3.215794 -0.002352
C  3.60696 -0.624656 -0.017352
C  -0.913863 -3.097579 -0.005467
C  2.793357 -1.802136 -0.009103
C  -5.049715 -0.37657 0.034116
C  5.112957 -0.731409 -0.041384
H  -3.274898 1.736324 0.022721
H  -3.372303 -2.570736 0.013088
H  3.517048 1.527017 -0.011236
H  -0.749779 4.178196 0.009968
H  -2.041481 3.358552 -0.874514
H  -2.030265 3.357546 0.909689
H  2.332831 3.243612 0.884998
H  2.326236 3.244341 -0.89452
H  1.091983 4.145583 0.000204
H  -0.287656 -3.249801 -0.893569
H  -0.28138 -3.26001 0.876303
H  -1.764732 -3.795617 -0.006867
H  3.263644 -2.792875 -0.006022
H  -5.444963 0.187391 -0.829483
H  -5.478117 -1.391438 -0.002824
H  -5.429815 0.115586 0.947411
H  5.475495 -1.472937 0.692671
H  5.467882 -1.062782 -1.035763
H  5.5955 0.234548 0.179965
