program: Gaussian 09
title: 000168167
version: EM64L-G09RevD.01
frameworkgroup: C1[X(C14H16N4O5S)]
method: RPBEPBE
basis: SDD
operation: Freq
keyword: #p
keyword: freq=noraman
keyword: PBEPBE/SDD
title: #p freq=noraman PBEPBE/SDD
converged: YES YES NO NO
title: Mulliken charges:
elementType: S O O O O O N N N N C C C C C C C C C C C C C C H H H H H H H H H H H H H H H H
charge: 0.982686 -0.537241 -0.492821 -0.251792 -0.251452 -0.246882 -0.610477 -0.455855 -0.113165 -0.102600 -0.067524 -0.183002 -0.219104 0.500613 -0.338905 -0.427355 0.084564 0.237694 0.253929 -0.426790 0.231891 -0.777436 -0.510930 -0.516026 0.278581 0.286444 0.360816 0.320484 0.233657 0.309276 0.275574 0.215548 0.263991 0.264174 0.240070 0.233559 0.237562 0.241475 0.243184 0.233583
chargesum: 0.00000
title: Mulliken charges with hydrogens summed into heavy atoms:
elementType: S O O O O O N N N N C C C C C C C C C C C C C C
charge: 0.982686 -0.537241 -0.492821 -0.251792 -0.251452 -0.246882 -0.249661 -0.146578 -0.113165 -0.102600 -0.067524 0.095579 0.067341 0.500613 -0.018422 -0.193698 0.084564 0.237694 0.253929 -0.151215 0.231891 -0.033723 0.200261 0.202216
polarizability: 3.25247263e+02 -2.18662301e+01 2.32382758e+02 5.54890326e+00 -2.35828549e+01 1.68960200e+02
1716.lowfreq: -4.6495 0.0009 0.0017 0.0022 2.5054 4.7527 14.3823 15.7297 26.6833
frequency: 14.1849 15.6411 26.6566 36.2797 56.3332 69.6863 76.1649 79.3618 97.3645 102.6485 132.1235 153.2503 153.4700 167.9478 176.2587 180.0995 185.7573 211.8015 221.4088 227.6162 239.5693 243.9650 280.2451 317.5216 328.5462 353.1464 362.1501 383.1072 412.9555 419.8252 449.3227 475.2742 513.1272 528.1392 548.6207 582.4163 597.0542 608.7214 618.9050 653.3071 657.5409 661.1793 671.7779 676.9741 728.1004 733.6298 763.7343 807.5534 825.3638 831.0168 832.1252 861.6645 868.8334 918.5065 930.2258 953.6704 957.2899 959.9993 986.5794 992.4058 995.3218 1021.3845 1040.8466 1050.1478 1056.0677 1113.3054 1119.7536 1123.2118 1140.8399 1161.8613 1167.8038 1183.5815 1214.7667 1236.0209 1266.7899 1296.8063 1310.2840 1351.6707 1373.1194 1381.4063 1391.8880 1407.3645 1418.4749 1438.8714 1448.6075 1452.5144 1452.7753 1463.9139 1467.6593 1469.4757 1471.5836 1477.3528 1505.6696 1521.4112 1559.8694 1597.9313 1601.1375 1632.1000 2996.7871 2998.6804 3003.0551 3099.8608 3100.0175 3101.8371 3105.5013 3128.4498 3141.7989 3144.1831 3167.8779 3177.0752 3197.8012 3223.0700 3496.5547 3534.4090
redmass: 4.7971 5.4684 2.7731 1.4838 4.0624 5.2027 3.7615 4.1590 5.1833 6.9593 2.5404 1.4463 4.6235 4.7982 5.1450 1.8723 1.8177 6.7887 6.0124 6.5192 6.4184 5.2777 6.0066 8.3458 5.7180 5.3806 4.9197 5.2899 3.0954 7.2222 7.3213 5.9962 1.9712 2.7759 4.2327 6.0209 3.1232 2.9349 6.9731 5.7800 1.1884 8.3992 5.3114 5.8972 3.1788 3.0125 5.3607 11.7025 5.0372 1.4004 1.7097 1.5653 5.8180 9.9857 6.2039 10.1714 9.0884 1.4410 4.0473 1.3509 1.7214 2.7214 1.6416 3.7450 2.4402 1.2512 1.2772 1.2749 1.4973 1.5652 2.1563 1.1313 3.3999 1.7461 1.9099 1.4135 5.6342 3.7393 4.0078 2.1956 1.2386 4.6417 2.5845 1.3663 1.0448 1.0511 1.0544 1.3192 1.5456 1.1710 1.0802 2.0793 2.2390 9.4661 6.3857 6.4432 6.1736 4.7235 1.0297 1.0363 1.0293 1.0984 1.1050 1.1002 1.1046 1.0900 1.1039 1.1047 1.0954 1.0902 1.0960 1.0945 1.0769 1.0767
irintensity: 0.6634 2.0190 1.0456 2.8053 0.0659 5.0922 3.2805 6.7277 0.3483 2.9893 0.1454 0.0407 0.3723 5.8121 6.6959 0.0896 1.6792 6.7690 2.7613 9.0641 5.4456 3.4466 7.5080 3.2466 35.8953 54.7053 0.1887 1.1856 3.2886 25.5467 132.1782 2.5383 31.1387 85.0419 55.8216 9.7043 1.3978 56.2698 3.4310 8.0897 55.1754 0.9145 20.4632 28.9822 35.9375 136.9785 1.7608 108.2624 21.6803 20.0898 59.5549 56.4514 14.4288 9.3680 3.5762 54.5580 13.5939 2.7723 5.3290 5.5438 14.4878 115.9795 15.4136 32.7006 43.1029 0.1788 5.8031 4.8275 13.0087 7.3857 319.1579 40.9546 70.0893 13.3902 63.1257 57.4488 104.5023 453.4393 244.3960 43.9634 41.8924 19.7666 263.2429 3.8050 16.0942 12.3542 17.4188 40.7191 26.3436 17.6933 21.8475 45.3196 445.3159 446.1125 605.0313 108.6258 22.0984 105.6338 38.8908 9.7130 45.8681 7.1315 24.1644 14.7300 27.7442 14.4454 25.5517 28.1288 4.5940 5.7569 8.1779 1.0431 72.0583 16.4587
temp: 298.150 k
press: 1.00000 atm
elementType: 16 8 8 8 8 8 7 7 7 7 6 6 6 6 6 6 6 6 6 6 6 6 6 6 1 1 1 1 1 1 1 1 1 1 1 1 1 1 1 1
symmnumber: 1
zpe: 771105.0 jmol-1
zpe.correction: 0.293698 hartree
zpe.thermalcorrener: 0.318412 hartree
zpe.thermalcorrenthalpy: 0.319356 hartree
zpe.thermalcorrgfe: 0.235857 hartree
zpe.sumelectzpe: -1534.340124 hartree
zpe.sumelectthermal: -1534.315411 hartree
zpe.sumelectthermalent: -1534.314467 hartree
zpe.sumelectthermalfe: -1534.397965 hartree
dipole: 4.5064 -0.6937 -5.8201
dipole: 7.3934
quadrupole: -107.6899 -164.8077 -144.6834
quadrupole: 2.3277 -10.5610 -11.7531
quadrupole: 31.3705 -25.7474 -5.6231 2.3277 -10.5610 -11.7531
hfenergy: -1534.6338227 hartree
pointgroup: C01 [X(C14H16N4O5S1)]
dipole: -2.6217619 -0.9448976 0.8334256 debye
polarizability: 285.9278573|-24.7785459|196.6157871|62.2987089|27.4205632|244.046576 unknown
InChI: InChI=1S/C14H16N4O5S/c1-9(19)15-10-4-6-11(7-5-10)24(20,21)18-14-16-12(22-2)8-13(17-14)23-3/h4-8,15,18H,1-3H3
charge 0 multiplicity 1
40 atoms
S  0.797648 2.244877 0.853867
O  0.545716 3.376409 1.996667
O  1.768047 2.519422 -0.41302
O  4.2682 -2.761575 2.79553
O  2.230202 -2.333144 -1.491314
O  -4.223432 -0.434062 -3.274261
N  1.41265 0.853449 1.91713
N  -4.646961 0.436292 -1.13407
N  2.873163 -0.903457 2.347865
N  1.780416 -0.707895 0.173548
C  -0.862185 1.643698 0.231508
C  -0.939948 1.095263 -1.055774
C  -1.976795 1.818735 1.067938
C  -3.348807 0.830319 -0.717072
C  -2.197094 0.68368 -1.54105
C  -3.22891 1.403254 0.581811
C  2.05296 -0.290928 1.442175
C  3.448197 -2.067445 1.931362
C  2.413563 -1.853832 -0.212028
C  3.262567 -2.599465 0.636241
C  -5.034375 -0.157226 -2.344935
C  -6.527796 -0.44693 -2.460407
C  4.476865 -2.18199 4.140604
C  1.373405 -1.543509 -2.400959
H  -0.037323 1.00675 -1.66591
H  -1.869464 2.28257 2.053001
H  1.719527 1.215094 2.829927
H  -2.306177 0.255815 -2.538678
H  -4.118431 1.528012 1.211302
H  -5.395601 0.60718 -0.459044
H  3.750674 -3.515182 0.30705
H  -7.112421 -0.16748 -1.566936
H  -6.668871 -1.523767 -2.655446
H  -6.930714 0.096349 -3.332457
H  4.940347 -1.184097 4.064841
H  5.149159 -2.894621 4.639496
H  3.518064 -2.095633 4.678813
H  1.762084 -0.515486 -2.500362
H  0.337101 -1.513505 -2.023905
H  1.427051 -2.080839 -3.358547
