program: Gaussian 09
title: 000168079
version: EM64L-G09RevD.01
frameworkgroup: C1[X(C7H16FO2P)]
method: RPBEPBE
basis: SDD
operation: Freq
keyword: #p
keyword: freq=noraman
keyword: PBEPBE/SDD
title: #p freq=noraman PBEPBE/SDD
converged: NO YES NO NO
title: Mulliken charges:
elementType: P F O O C C C C C C C H H H H H H H H H H H H H H H H
charge: 1.338150 -0.397601 -0.567476 -0.610416 0.309535 0.018474 -0.731924 -0.732253 -0.717538 -0.740670 -0.917382 0.242380 0.214561 0.219500 0.216039 0.208831 0.209033 0.239198 0.206522 0.246030 0.208400 0.227482 0.235898 0.234582 0.276847 0.281584 0.282215
chargesum: 0.00000
title: Mulliken charges with hydrogens summed into heavy atoms:
elementType: P F O O C C C C C C C
charge: 1.338150 -0.397601 -0.567476 -0.610416 0.309535 0.260854 -0.081824 -0.075192 -0.056585 -0.042708 -0.076736
polarizability: 1.21783820e+02 1.57530041e-01 9.85598250e+01 -2.82721112e+00 -2.52547698e+00 9.70747548e+01
1716.lowfreq: 0.0014 0.0018 0.0022 4.2886 7.0409 8.4032 20.2982 54.6543 65.9258
frequency: 17.4009 54.5491 65.7952 120.5325 165.4606 171.1837 189.0462 202.3286 205.7874 233.7506 244.6758 256.0211 266.5120 271.0803 311.6420 339.1108 357.4654 363.1953 390.9145 437.9274 460.0929 512.6011 619.9801 695.5561 713.2915 744.6559 858.5854 874.7040 929.8197 931.9959 945.1437 945.7603 973.8300 990.9549 1003.1078 1035.4812 1073.7023 1082.6663 1120.9769 1210.5078 1224.5565 1269.2479 1329.9103 1333.9609 1355.9414 1374.8186 1379.6815 1390.7253 1407.7728 1433.8690 1436.2869 1456.6986 1464.3396 1465.6843 1470.9671 1478.4758 1484.5531 1491.7775 1499.9456 2973.7090 2978.2037 2982.1759 2986.1798 2997.1526 3030.5508 3064.5502 3069.1399 3072.5638 3079.3866 3089.9719 3093.2138 3100.1126 3101.9942 3152.3107 3155.9954
redmass: 4.5191 2.7633 4.8577 3.5733 1.2113 1.4419 1.7415 3.5748 1.6349 1.2201 1.1225 3.2911 1.7991 2.4903 3.5001 3.4454 2.5803 2.6708 3.9384 3.4836 2.9643 2.7546 8.7099 5.5753 2.9933 4.6918 2.8264 3.6279 1.6839 1.6402 1.3494 1.3518 1.3700 1.4512 1.4789 1.6350 1.4758 5.3620 2.5191 2.2860 2.9828 2.9697 1.4991 1.1807 1.1631 1.2136 1.2025 1.2290 1.2030 1.0433 1.0442 1.0483 1.0513 1.0490 1.0486 1.0478 1.0521 1.0532 1.0654 1.0361 1.0367 1.0463 1.0744 1.0366 1.0318 1.0994 1.0990 1.0987 1.0991 1.0996 1.0986 1.0980 1.1002 1.1022 1.1024
irintensity: 2.8550 0.6163 1.0628 9.8390 0.0994 0.9294 0.4151 4.0926 0.8613 1.7372 0.3242 1.4557 1.0484 2.0725 10.9102 11.1726 5.3115 7.9354 31.8704 8.6346 3.7308 7.1536 46.3923 56.2203 1.7478 43.8760 90.3806 265.3397 3.3330 1.0276 8.5994 3.3687 78.6862 7.0856 10.7128 16.4310 29.8304 141.2838 10.6106 12.9631 3.8045 2.3475 0.9878 7.6721 22.8022 26.0071 9.5348 38.5650 14.3968 11.3857 13.5279 0.9644 3.1649 7.2825 1.9348 17.9286 8.4310 5.8491 30.2602 24.6235 35.3317 19.9199 11.9083 13.3081 0.2284 0.7281 29.3916 49.2078 69.1298 12.1366 31.1195 30.3927 19.7512 0.6759 0.6807
temp: 298.150 k
press: 1.00000 atm
elementType: 15 9 8 8 6 6 6 6 6 6 6 1 1 1 1 1 1 1 1 1 1 1 1 1 1 1 1
symmnumber: 1
zpe: 586554.3 jmol-1
zpe.correction: 0.223407 hartree
zpe.thermalcorrener: 0.238486 hartree
zpe.thermalcorrenthalpy: 0.239430 hartree
zpe.thermalcorrgfe: 0.181313 hartree
zpe.sumelectzpe: -866.955000 hartree
zpe.sumelectthermal: -866.939921 hartree
zpe.sumelectthermalent: -866.938977 hartree
zpe.sumelectthermalfe: -866.997094 hartree
dipole: 1.1455 1.1140 3.0638
dipole: 3.4554
quadrupole: -69.3206 -78.7380 -79.2435
quadrupole: -0.5094 -11.3890 1.5736
quadrupole: 6.4467 -2.9706 -3.4761 -0.5094 -11.3890 1.5736
hfenergy: -867.1784069 hartree
pointgroup: C01[X(C7H16F1O2P1)]
dipole: -0.1519684 -0.1778869 -1.3391938 debye
polarizability: 119.3089322|-6.1952634|102.2430766|4.5223514|-0.8182387|95.8663909 unknown
InChI: InChI=1S/C7H16FO2P/c1-6(7(2,3)4)10-11(5,8)9/h6H,1-5H3
charge 0 multiplicity 1
27 atoms
P  1.725309 -0.410976 1.185298
F  1.166246 -1.711854 2.221998
O  0.440721 -0.252648 0.065037
O  2.113997 0.876297 2.024182
C  -2.014443 0.05667 0.202993
C  -0.640228 0.789045 0.283721
C  -3.140733 1.104669 0.426957
C  -2.201736 -0.636245 -1.17084
C  -2.085333 -1.003186 1.335014
C  -0.375987 1.895425 -0.743652
C  2.999376 -1.308586 0.199176
H  -0.514785 1.196275 1.308753
H  -2.992377 1.664606 1.370356
H  -4.117049 0.590749 0.493172
H  -3.201091 1.831687 -0.402607
H  -2.23991 0.094931 -1.999201
H  -3.151494 -1.202153 -1.180908
H  -1.375615 -1.341531 -1.367784
H  -3.068741 -1.508181 1.320155
H  -1.301375 -1.770307 1.221355
H  -1.960028 -0.536615 2.330919
H  -1.138139 2.690392 -0.667412
H  0.609694 2.356175 -0.557251
H  -0.386127 1.494529 -1.771154
H  3.430864 -0.622737 -0.54481
H  3.786372 -1.668509 0.878794
H  2.522713 -2.160921 -0.306362
