program: Gaussian 09
title: 000013050
version: EM64L-G09RevD.01
frameworkgroup: C1[X(C10H12O3)]
method: RPBEPBE
basis: SDD
operation: Freq
keyword: #pfreq=noraman
keyword: PBEPBE/SDD
title: #p freq=noraman PBEPBE/SDD
converged: YES YES NO NO
title: Mulliken charges:
elementType: O O O C C C C C C C C C C H H H H H H H H H H H H
charge: -0.252943 -0.454326 -0.255693 -0.292073 0.381757 -0.364667 -0.381687 0.220787 -0.223813 -0.217997 -0.226134 -0.239993 -0.671496 0.262006 0.248116 0.267165 0.224903 0.226775 0.236597 0.235003 0.228101 0.366371 0.217399 0.232928 0.232914
chargesum: 0.00000
title: Mulliken charges with hydrogens summed into heavy atoms:
elementType: O O O C C C C C C C C C C
charge: -0.252943 -0.087955 -0.255693 -0.030067 0.381757 -0.116551 -0.114522 0.220787 0.001090 0.008779 0.245466 -0.011892 0.011745
polarizability: 1.36095947e+02 -1.91739789e+00 1.25185540e+02 1.25254335e+01 8.57417769e+00 7.73011172e+01
1716.lowfreq: -8.6785 -5.7286 -0.0007 -0.0005 0.0003 7.3392 21.0538 35.5119 62.9789
frequency: 20.7108 35.4682 62.9761 72.0401 136.5544 145.8124 205.5719 234.6061 261.8396 309.2964 315.4699 372.0257 394.4917 413.2387 443.0874 492.9817 581.0799 615.1009 655.1520 699.5808 719.0013 763.1522 799.3347 811.4357 837.2756 857.4508 901.1106 935.4479 980.8286 989.7080 998.6735 1010.4245 1023.7101 1029.2837 1085.2231 1113.6340 1134.4604 1162.8163 1169.5285 1174.5341 1188.9481 1227.1813 1251.2124 1270.9040 1319.6329 1354.2651 1369.1708 1388.5511 1402.2043 1436.4843 1463.8382 1472.7616 1478.6013 1485.3883 1594.6559 1608.4577 1618.0607 2998.4974 3018.1758 3025.7025 3078.7013 3095.2444 3112.0816 3122.8596 3132.2970 3145.0272 3158.5493 3170.1781 3452.0868
redmass: 3.6666 2.7999 5.2618 3.4828 4.0710 2.8650 4.7093 1.9943 2.0974 4.9961 5.8862 3.1167 2.0088 1.8672 2.9011 3.4352 6.9339 6.4338 5.7863 3.1060 1.7785 2.7981 1.1026 3.8660 3.6617 1.2464 4.4579 1.5726 1.4729 4.3076 1.3533 2.7491 2.9576 2.4157 1.6079 2.2646 1.4613 2.8033 1.2742 1.4699 1.3038 1.7630 1.1386 1.3492 1.3123 1.3085 1.6335 3.9605 1.2679 2.1836 1.0398 1.0705 2.2054 1.0666 6.3041 6.4697 8.4501 1.0359 1.0583 1.0841 1.1066 1.0984 1.1035 1.0846 1.0884 1.0937 1.0971 1.0979 1.0649
irintensity: 0.2470 0.2686 2.0680 0.4544 0.1339 3.6099 6.0082 1.7086 5.6088 11.5260 19.7905 23.4203 35.5202 48.7404 28.9388 22.5084 12.5910 0.4676 11.1365 12.2333 84.5887 19.3880 5.1683 10.1440 4.6865 0.4518 7.2981 3.9834 0.3911 0.5986 0.8398 32.8115 113.7461 59.1144 9.4185 3.6127 5.4640 260.3923 5.9601 7.3182 2.6798 164.6226 0.1258 3.3409 3.8802 4.2330 32.7217 6.5153 29.3623 13.5074 12.5631 5.1867 21.2170 15.3110 1.5330 51.1721 123.5011 15.8989 15.7602 12.5318 3.8508 27.1107 42.4102 0.3960 7.1810 26.8814 22.3236 13.2928 42.2450
temp: 298.150 k
press: 1.00000 atm
elementType: 8 8 8 6 6 6 6 6 6 6 6 6 6 1 1 1 1 1 1 1 1 1 1 1 1
symmnumber: 1
zpe: 522791.0 jmol-1
zpe.correction: 0.199121 hartree
zpe.thermalcorrener: 0.212054 hartree
zpe.thermalcorrenthalpy: 0.212998 hartree
zpe.thermalcorrgfe: 0.157780 hartree
zpe.sumelectzpe: -612.957627 hartree
zpe.sumelectthermal: -612.944694 hartree
zpe.sumelectthermalent: -612.943750 hartree
zpe.sumelectthermalfe: -612.998968 hartree
dipole: -1.9306 -3.1240 0.5083
dipole: 3.7074
quadrupole: -64.8037 -77.1675 -79.3345
quadrupole: 2.8423 4.1867 1.6786
quadrupole: 8.9648 -3.3989 -5.5659 2.8423 4.1867 1.6786
hfenergy: -613.1567479 hartree
pointgroup: C01 [X(C10H12O3)]
dipole: 0.5504484 -1.2400635 0.5355615 debye
dipolederiv: -0.8725151 0.4626879 -0.2574102 0.6207017 -0.8663515 0.4269265 -0.2805856 0.4217023 -0.6810182 -0.5652606 -0.1134945 -0.0957159 -0.2032052 -0.7086953 0.1756477 -0.0207264 0.1557788 -0.3858015 -0.6773154 -0.0417667 0.2474465 0.237813 -0.4912703 0.1135432 0.156035 0.3812746 -0.7823775 0.0110846 0.1697327 0.0641354 0.1799046 0.5091339 -0.0859172 -0.0337835 -0.1858564 0.3200463 0.1717357 0.0735897 0.0088075 0.2958272 -0.0894756 0.0034439 0.0480913 0.0111203 -0.0499022 -0.0898287 -0.0309318 0.1031044 -0.0427292 -0.1110298 -0.0422121 0.1007339 -0.0461621 -0.0482064 -0.2013409 0.0061939 0.008524 -0.0474649 -0.0204098 -0.0949369 0.03633 -0.0596383 -0.0628801 1.0536984 -0.2114509 -0.1682772 -0.7175331 0.6658594 -0.4131049 0.0512114 -0.7135702 1.1127549 -0.077152 0.0495037 0.0172934 0.0571282 0.0055559 -0.1233216 0.0001831 -0.1203882 -0.0059193 0.0280213 0.0133934 0.1357533 0.009319 -0.0785623 -0.0539589 0.1058708 -0.0639399 0.0179091 0.6846881 -0.2647372 0.1780789 -0.3165118 0.5796084 -0.1110231 0.0656166 -0.0012788 0.2656141 -0.0023171 0.1143619 0.0427578 0.0925275 -0.0468655 -0.028168 0.0459656 -0.021915 -0.1020054 0.0044934 0.0441531 -0.0329054 0.0714038 -0.0524918 0.0986386 -0.0205082 0.0843126 -0.01919 0.0404272 -0.0390059 -0.0235502 -0.0442308 0.0182635 -0.0017167 -0.035683 0.0020986 -0.0831511 0.0488099 0.0023735 -0.114499 0.0112584 0.0996185 0.0314636 -0.1183358 0.0369713 0.0281084 0.1464191 -0.0221097 0.0047671 0.0008794 0.0531718 0.0945452 0.0065958 0.0844839 0.0615055 0.0907245 -0.0426552 -0.0044356 -0.0651682 -0.0112566 0.1299397 0.003891 0.1312439 0.0167996 -0.0111179 -0.0039516 -0.1229118 -0.0055427 0.1018452 0.0540731 -0.1372994 0.0471615 0.0010053 -0.0027998 0.0276057 -0.0823561 0.0484894 -0.0013779 -0.0246199 -0.0063428 -0.0816382 -0.0757785 -0.1061122 -0.0094481 -0.0128186 -0.0650862 -0.0630184 0.046724 0.0357315 0.0094294 0.0740448 -0.0474484 -0.1277947 -0.0359391 -0.132527 0.039576 0.0160619 -0.0354038 0.0172291 0.1142653 0.3538707 -0.0164727 0.096696 0.0274205 0.3904222 -0.1144219 0.0524011 -0.0451107 0.2121436 -0.0633938 0.131059 0.0192851 0.1313141 0.0115943 0.0073654 0.034309 -0.009441 0.0805967 0.1208168 -0.0301833 -0.0080128 -0.0318205 0.0328617 -0.1138404 -0.0434592 -0.0600659 -0.0836937 -0.0381878 -0.1406521 0.0321825 -0.1121674 0.033294 0.0088687 -0.0108383 0.0261984 0.0751304 unknown
polarizability: 133.3614|9.2631034|105.1359166|14.2867712|-24.5094389|100.0852878 unknown
InChI: InChI=1S/C10H12O3/c1-2-13-10(12)9(11)8-6-4-3-5-7-8/h3-7,9,11H,2H2,1H3
charge 0 multiplicity 1
25 atoms
O  1.920558 -0.290292 0.608168
O  0.166895 2.546668 -0.847969
O  2.140901 0.77831 -1.453119
C  0.251874 1.371911 0.003671
C  -0.983261 0.458689 -0.123155
C  -1.187612 -0.602327 0.794281
C  -1.930778 0.688211 -1.147157
C  1.533579 0.599485 -0.367478
C  -2.324432 -1.432034 0.67889
C  -3.066277 -0.14638 -1.263348
C  3.119526 -1.144792 0.299902
C  -3.266376 -1.209218 -0.353249
C  3.275514 -2.117371 1.462386
H  0.34499 1.71889 1.048875
H  -0.456073 -0.782651 1.590156
H  -1.780403 1.534304 -1.824269
H  -2.477081 -2.248673 1.393674
H  -3.79695 0.039617 -2.058709
H  2.936429 -1.652775 -0.663405
H  3.989296 -0.474016 0.183175
H  -4.14896 -1.852668 -0.44226
H  0.764661 2.38955 -1.631444
H  4.15268 -2.766275 1.286794
H  3.428583 -1.578377 2.412713
H  2.384217 -2.759785 1.562178
