program: Gaussian 09
title: 000168045
version: EM64L-G09RevD.01
frameworkgroup: C1[X(C10H12N2O5)]
method: RPBEPBE
basis: SDD
operation: Freq
keyword: #p
keyword: freq=noraman
keyword: PBEPBE/SDD
title: #p freq=noraman PBEPBE/SDD
converged: YES YES NO NO
title: Mulliken charges:
elementType: O O O O O N N C C C C C C C C C C H H H H H H H H H H H H
charge: -0.251000 -0.226439 -0.447036 -0.423933 -0.207806 -0.207762 0.035512 -0.151029 -0.114808 -0.121867 -0.127690 0.158010 -0.336144 -0.250938 0.241757 -0.062174 -0.763372 0.303269 0.283896 0.258455 0.265962 0.230149 0.224653 0.271997 0.353405 0.353585 0.253554 0.205123 0.252670
chargesum: 0.00000
title: Mulliken charges with hydrogens summed into heavy atoms:
elementType: O O O O O N N C C C C C C C C C C
charge: -0.251000 -0.226439 -0.093630 -0.070348 -0.207806 -0.207762 0.035512 0.152240 0.169088 0.136589 0.138272 0.158010 0.118659 0.021059 0.241757 -0.062174 -0.052025
polarizability: 1.90421967e+02 -9.41492095e+00 1.03257032e+02 1.20512798e+01 7.50863989e+00 1.11255751e+02
1716.lowfreq: -9.3920 -2.6650 -0.0006 -0.0002 0.0002 4.4496 32.8315 47.0779 71.0719
frequency: 32.7553 47.0094 71.0522 92.6049 122.5552 133.2191 150.0127 186.9910 206.7859 234.8473 267.4443 274.2161 296.7497 315.4230 351.6746 383.3784 397.9904 425.9994 435.2825 487.4836 505.1227 542.6680 566.8148 644.7528 660.3934 681.5089 736.0318 751.3634 754.6518 776.6899 825.0513 836.2553 854.8346 884.4488 911.0735 950.5284 961.7713 985.2306 993.6019 1006.0842 1019.3690 1047.1662 1059.5616 1064.4204 1074.5572 1101.7330 1148.6022 1155.7680 1176.6793 1213.8902 1229.8065 1257.5472 1266.6162 1274.5231 1288.1230 1304.8298 1311.8665 1337.8465 1346.0050 1367.8792 1383.5970 1396.5732 1403.3119 1444.0337 1464.7339 1467.8717 1553.3589 1611.3413 1651.7185 2979.6726 2987.5670 3013.4958 3047.7977 3071.8484 3072.8902 3079.2491 3094.0819 3105.4021 3170.2182 3543.9385 3582.1924
redmass: 5.3530 7.3811 6.1255 4.1876 1.3140 2.0207 5.1543 5.4017 4.6445 1.3264 3.6673 3.7348 5.3231 4.9986 3.8219 4.5660 3.8153 1.9727 2.4029 6.1122 3.7591 6.6225 6.1544 5.8096 9.7870 7.0414 4.3033 7.4613 7.9576 3.7797 4.5132 5.0972 1.4003 3.4502 3.9645 3.3273 6.4135 2.4360 3.2329 1.9115 2.4530 1.4892 4.5728 3.1228 2.4730 4.8709 2.5471 1.2935 1.2052 1.3641 1.7483 1.2420 4.1284 1.3368 1.3835 1.4268 1.3484 1.2627 1.7179 1.4901 1.2943 4.4216 1.2721 1.0438 1.0863 1.0888 10.5277 9.9326 7.0787 1.0660 1.0359 1.0861 1.0864 1.0969 1.0979 1.0889 1.1012 1.0894 1.0953 1.0656 1.0667
irintensity: 2.0361 4.8767 2.7937 1.6636 2.3574 6.1805 1.1725 9.5253 3.0527 119.0747 28.2317 15.3771 2.6301 1.9942 12.7506 12.5335 2.7715 55.8923 39.4149 14.3754 13.2889 7.2933 11.8842 4.4698 2.6293 4.3336 5.8027 21.0513 53.5996 20.3527 18.1747 47.3833 19.7826 24.7860 147.5145 15.1980 141.9403 3.4200 140.3451 7.2934 19.0206 7.5870 7.5316 14.6269 20.1559 128.0887 92.3880 22.0311 15.6732 1.8754 57.1041 8.6199 83.9139 11.6102 12.4459 1.5774 15.7606 9.5286 1.3900 8.5005 31.3798 280.7855 11.4162 12.5159 5.3182 5.5379 570.5797 52.6951 271.2499 30.1588 19.8075 20.4591 13.6817 10.6257 37.9512 11.5817 16.7711 8.4121 4.6035 6.7880 16.4012
temp: 298.150 k
press: 1.00000 atm
elementType: 8 8 8 8 8 7 7 6 6 6 6 6 6 6 6 6 6 1 1 1 1 1 1 1 1 1 1 1 1
symmnumber: 1
zpe: 573693.3 jmol-1
zpe.correction: 0.218508 hartree
zpe.thermalcorrener: 0.234054 hartree
zpe.thermalcorrenthalpy: 0.234998 hartree
zpe.thermalcorrgfe: 0.175231 hartree
zpe.sumelectzpe: -872.569761 hartree
zpe.sumelectthermal: -872.554216 hartree
zpe.sumelectthermalent: -872.553271 hartree
zpe.sumelectthermalfe: -872.613038 hartree
dipole: 5.9784 0.9834 5.2002
dipole: 7.9844
quadrupole: -100.0349 -109.9340 -102.9509
quadrupole: -9.8331 -19.3534 -1.5722
quadrupole: 4.2717 -5.6274 1.3557 -9.8331 -19.3534 -1.5722
hfenergy: -872.7882693 hartree
pointgroup: C01 [X(C10H12N2O5)]
dipole: 2.3659122 -0.2900519 -2.0460065 debye
polarizability: 189.3931352|13.2212448|104.3315798|-12.4741396|6.9845807|111.2100353 unknown
InChI: InChI=1S/C10H12N2O5/c1-4-2-12-9-7(6(14)5(3-13)16-9)17-10(12)11-8(4)15/h2,5-7,9,13-14H,3H2,1H3
charge 0 multiplicity 1
29 atoms
O  1.70887 -0.878029 -1.111592
O  0.555593 1.662788 0.755063
O  3.912431 1.286257 -0.598498
O  1.720129 -2.850721 1.011581
O  -3.938958 0.292972 1.314385
N  -0.436066 0.282394 -0.77835
N  -1.713472 1.036934 1.127588
C  1.561147 1.428417 -0.321209
C  0.939168 0.361614 -1.278378
C  2.833393 0.775547 0.253332
C  2.602212 -0.745333 0.089242
C  -0.628016 0.986596 0.415135
C  1.958949 -1.439287 1.304027
C  -1.507966 -0.465435 -1.285493
C  -2.70834 -0.479235 -0.614781
C  -2.857843 0.291117 0.664293
C  -3.907184 -1.251932 -1.099921
H  1.792557 2.391677 -0.797324
H  0.967045 0.604977 -2.351555
H  2.977077 1.067588 1.31191
H  3.5228 -1.288922 -0.1889
H  1.027533 -0.924495 1.617422
H  2.660626 -1.432574 2.156099
H  -1.322699 -1.015401 -2.211515
H  4.769122 0.854329 -0.355989
H  1.181486 -2.902387 0.179586
H  -4.231696 -1.975857 -0.330878
H  -3.698188 -1.792039 -2.039578
H  -4.763609 -0.57166 -1.2573
