program: Gaussian 09
title: 000013049
version: EM64L-G09RevD.01
frameworkgroup: C1[X(C10H16N2O)]
method: RPBEPBE
basis: SDD
operation: Freq
keyword: #p
keyword: freq=noraman
keyword: PBEPBE/SDD
title: #p freq=noraman PBEPBE/SDD
converged: YES YES NO NO
title: Mulliken charges:
elementType: O N N C C C C C C C C C C H H H H H H H H H H H H H H H H
charge: -0.470982 -0.287155 -0.694644 -0.114159 -0.265977 0.474027 -0.740090 -0.446189 -0.369993 -0.657850 -0.410962 -0.415889 0.487123 0.241162 0.199715 0.236908 0.205143 0.237454 0.284089 0.227957 0.253780 0.342063 0.196716 0.230676 0.219971 0.214285 0.214639 0.304465 0.303715
chargesum: 0.00000
title: Mulliken charges with hydrogens summed into heavy atoms:
elementType: O N N C C C C C C C C C C
charge: -0.128919 -0.003067 -0.086464 0.127004 -0.066261 0.474027 -0.060584 -0.218232 -0.116213 -0.010486 -0.196677 -0.201250 0.487123
polarizability: 1.93617296e+02 -6.42320322e+00 1.05102002e+02 -7.71194546e+00 -1.49132469e+01 9.66478600e+01
1716.lowfreq: -8.7606 -0.0007 -0.0003 -0.0001 6.2903 10.0323 43.5955 51.7980 65.0161
frequency: 43.5214 51.5673 64.9901 95.3408 163.2223 179.5499 194.7763 219.3511 266.4245 284.8169 298.4406 320.8208 342.4994 350.3259 374.0185 382.5581 410.0496 422.8366 499.6209 507.0303 545.1968 578.5528 636.8169 714.8365 735.8429 792.8999 817.7248 819.9641 835.9316 851.2478 880.3969 936.1232 953.1947 956.6025 1000.2324 1011.0662 1018.7950 1053.8362 1078.0158 1114.9707 1128.6731 1162.6890 1180.9375 1184.6082 1207.9839 1220.4249 1280.2964 1292.7179 1313.2042 1318.6102 1327.4984 1358.0339 1382.8553 1390.8185 1431.7191 1436.2039 1465.6620 1468.8174 1477.5235 1486.4574 1498.9171 1516.3694 1579.7560 1630.9270 1643.7004 2883.1646 2943.4197 2985.0388 2988.0679 3022.7764 3073.2607 3080.0492 3098.6957 3107.3172 3114.2824 3131.6617 3143.9944 3451.2652 3567.6855 3568.1810 3708.0463
redmass: 3.1596 3.8339 4.0457 2.3847 3.0791 4.7647 1.3058 1.3839 3.4028 1.6689 1.6289 1.9591 1.2761 2.5199 1.0501 2.9590 2.8118 3.5079 3.9738 3.0524 2.5665 4.4623 6.8477 1.7017 3.1538 3.8268 1.4745 1.5162 4.5966 1.8890 1.9212 1.7754 2.5977 1.4370 2.7353 1.7033 1.5857 1.6378 1.7292 1.3833 1.2483 1.6734 1.7714 1.4172 1.7328 1.7056 1.4467 1.4507 2.7542 1.4949 1.3109 1.2747 1.2612 4.1640 1.1789 3.0445 1.1070 1.0618 1.1138 1.0611 1.0702 3.0618 6.6054 2.4746 1.6278 1.0553 1.0827 1.0563 1.0652 1.0743 1.0996 1.0981 1.0999 1.0866 1.0876 1.0961 1.0958 1.0736 1.0459 1.0649 1.1040
irintensity: 0.8567 1.1448 1.0759 1.2829 1.9344 1.5008 2.3143 1.6293 13.5758 3.6018 68.4859 57.3273 283.4645 57.8342 0.3531 5.7237 2.4996 4.8272 28.0718 14.9406 11.4848 29.5121 0.9068 148.8558 20.7392 11.0857 37.4510 35.2063 8.6967 25.1588 4.2126 20.3988 53.8853 6.8098 0.8081 4.8686 1.6190 3.3845 24.2038 7.1640 22.7987 56.9463 11.4979 65.4593 17.6678 21.5053 3.1777 17.9316 67.9064 8.2653 2.2731 7.3565 18.4886 10.6317 2.9539 0.1973 33.3072 8.2042 0.7268 2.4832 28.1588 115.5552 5.6712 7.9937 295.6474 101.9027 40.6872 10.1433 52.1519 62.4028 45.6071 29.2601 31.6775 14.5702 24.9679 33.0579 6.0225 2.6389 78.4633 2.7948 20.2829
temp: 298.150 k
press: 1.00000 atm
elementType: 8 7 7 6 6 6 6 6 6 6 6 6 6 1 1 1 1 1 1 1 1 1 1 1 1 1 1 1 1
symmnumber: 1
zpe: 646320.3 jmol-1
zpe.correction: 0.246170 hartree
zpe.thermalcorrener: 0.260382 hartree
zpe.thermalcorrenthalpy: 0.261326 hartree
zpe.thermalcorrgfe: 0.205465 hartree
zpe.sumelectzpe: -574.372313 hartree
zpe.sumelectthermal: -574.358102 hartree
zpe.sumelectthermalent: -574.357157 hartree
zpe.sumelectthermalfe: -574.413019 hartree
dipole: 4.1933 -0.6481 1.2004
dipole: 4.4096
quadrupole: -64.1749 -77.2813 -78.4271
quadrupole: 0.1386 -6.7157 -3.7998
quadrupole: 9.1196 -3.9869 -5.1327 0.1386 -6.7157 -3.7998
hfenergy: -574.6184837 hartree
pointgroup: C01 [X(C10H16N2O1)]
dipole: 1.662489 0.0869678 -0.4882036 debye
polarizability: 193.5091935|7.5936335|95.8792899|7.3414982|-14.6274178|105.9786742 unknown
InChI: InChI=1S/C10H16N2O/c1-7(12-2)10(13)8-3-5-9(11)6-4-8/h3-7,10,12-13H,11H2,1-2H3
charge 0 multiplicity 1
29 atoms
O  -1.635076 -1.870587 -0.193436
N  -3.536972 -0.015022 0.584854
N  4.457777 0.292475 0.337403
C  -2.097703 0.331873 0.65434
C  -1.231239 -0.450859 -0.391353
C  0.263679 -0.270815 -0.216064
C  -1.86971 1.851401 0.549118
C  1.040582 0.431931 -1.171262
C  0.928903 -0.789788 0.928184
C  -4.28709 0.434027 -0.605896
C  2.424694 0.626593 -0.996637
C  2.311036 -0.607964 1.115749
C  3.085058 0.109026 0.155237
H  -1.74865 -0.004508 1.651795
H  -1.522038 -0.126118 -1.415049
H  -0.819617 2.102984 0.774962
H  -2.097054 2.236535 -0.462606
H  -2.523469 2.371144 1.271002
H  -3.638329 -1.030513 0.718443
H  0.553634 0.836892 -2.067923
H  0.351304 -1.352023 1.671091
H  -0.993283 -2.444144 -0.683232
H  -3.877463 0.084024 -1.584151
H  -4.334397 1.536948 -0.633804
H  -5.325117 0.063732 -0.5283
H  3.001558 1.174258 -1.752342
H  2.802902 -1.021204 2.005488
H  4.927455 -0.074694 1.159434
H  5.009226 0.807899 -0.341849
