program: Gaussian 09
title: 000013047
version: EM64L-G09RevD.01
frameworkgroup: C1[X(C12H12O)]
method: RPBEPBE
basis: SDD
operation: Freq
keyword: #pfreq=noraman
keyword: PBEPBE/SDD
title: #p freq=noraman PBEPBE/SDD
converged: YES YES NO NO
title: Mulliken charges:
elementType: O C C C C C C C C C C C C H H H H H H H H H H H H
charge: -0.420482 0.434954 0.199330 -0.640947 0.402319 -0.436136 -0.382358 -0.452133 -0.321374 -0.246260 -0.430101 -0.265637 -0.244110 0.224650 0.210542 0.223611 0.229947 0.237671 0.192931 0.239617 0.225182 0.236721 0.225549 0.228004 0.328511
chargesum: 0.00000
title: Mulliken charges with hydrogens summed into heavy atoms:
elementType: O C C C C C C C C C C C C
charge: -0.091971 0.434954 0.199330 -0.205756 0.402319 -0.212525 -0.152411 -0.214462 0.111175 -0.021078 -0.193380 -0.040088 -0.016105
polarizability: 1.66146606e+02 1.68360291e+01 1.58570932e+02 -1.79520755e+01 5.67295024e+00 6.97163636e+01
1716.lowfreq: -14.3852 0.0003 0.0005 0.0006 0.8182 3.9363 51.1320 76.8191 116.0102
frequency: 50.8632 76.7697 116.0042 164.2292 182.2112 245.9798 283.2639 334.3618 403.5468 430.4190 450.0019 471.5377 484.8810 508.9896 551.6571 591.3174 654.3763 687.3308 743.1330 782.6739 788.4950 809.5476 828.0222 856.9176 878.3892 913.8864 953.4590 960.6634 968.6964 982.9359 991.3492 1022.7895 1038.2970 1046.5698 1082.3814 1128.5919 1152.3135 1173.3909 1181.7439 1219.2562 1236.8181 1250.4040 1271.6741 1318.3971 1339.1065 1376.6114 1382.3425 1406.4873 1418.4041 1441.4177 1455.8105 1470.1233 1471.6228 1518.5703 1591.0162 1599.9290 1633.3227 2948.2442 2979.0543 3027.3324 3088.3635 3118.7124 3119.9517 3127.7708 3129.6232 3145.9249 3155.3392 3162.1633 3556.6279
redmass: 4.9848 4.9725 2.4692 3.5211 3.7497 3.7700 1.4240 2.0520 3.4965 3.2633 2.7702 3.2670 3.6247 5.5997 5.3365 3.0125 3.1042 4.5086 1.2649 3.8088 2.2107 1.7234 2.6583 2.6770 1.8550 1.4727 2.1071 1.4914 2.1461 1.3646 1.3512 2.8811 3.3029 1.8825 2.2236 1.1976 1.3994 1.1221 1.2149 1.2445 1.8936 1.5522 1.7415 1.3744 1.3265 1.4208 1.7289 2.9202 5.0413 2.4584 2.4570 1.1314 1.0951 3.7760 7.5690 5.3628 6.5896 1.0688 1.0616 1.1000 1.0945 1.0861 1.0858 1.0914 1.0878 1.0943 1.0993 1.1003 1.0661
irintensity: 1.5294 1.2670 4.6656 9.8065 1.2202 4.9525 130.4783 60.9310 5.0364 5.0694 12.1936 0.8841 11.6238 2.0469 1.3940 2.1963 0.8055 2.1579 3.8969 12.1263 61.2008 65.3886 2.5489 6.0125 2.1436 4.8627 1.6369 12.1902 33.4681 2.3801 0.5020 36.0508 21.9376 13.5621 7.5324 17.3473 5.0312 1.3842 1.2071 10.3471 3.7543 2.8629 3.5710 6.9738 5.6028 15.8572 9.8558 2.4213 4.4257 2.2660 0.3800 10.2488 8.8459 9.6578 0.9161 7.5327 0.2194 74.1303 65.3504 19.8596 26.9150 5.0604 0.9242 22.3756 4.7232 39.5100 42.4427 24.7497 4.5349
temp: 298.150 k
press: 1.00000 atm
elementType: 8 6 6 6 6 6 6 6 6 6 6 6 6 1 1 1 1 1 1 1 1 1 1 1 1
symmnumber: 1
zpe: 537915.3 jmol-1
zpe.correction: 0.204881 hartree
zpe.thermalcorrener: 0.215839 hartree
zpe.thermalcorrenthalpy: 0.216783 hartree
zpe.thermalcorrgfe: 0.167834 hartree
zpe.sumelectzpe: -538.772839 hartree
zpe.sumelectthermal: -538.761882 hartree
zpe.sumelectthermalent: -538.760938 hartree
zpe.sumelectthermalfe: -538.809887 hartree
dipole: 0.5080 -0.2864 -1.8740
dipole: 1.9626
quadrupole: -64.9774 -67.2250 -85.1397
quadrupole: 1.0944 -9.8893 2.5633
quadrupole: 7.4700 5.2224 -12.6923 1.0944 -9.8893 2.5633
hfenergy: -538.9777203 hartree
pointgroup: C01 [X(C12H12O1)]
dipole: -0.1838861 -0.1481969 0.7351613 debye
dipolederiv: -0.6219906 -0.0696765 -0.3504654 -0.0642711 -0.5074606 0.1213478 -0.4339012 0.0299286 -0.4129715 0.1660499 0.1272611 -0.0268293 0.2455411 0.0996929 -0.028628 -0.0849675 -0.0394616 -0.0862996 -0.0147215 -0.1672445 0.0141199 -0.1229374 -0.0517386 0.0262281 0.0206088 0.0418515 -0.00622 0.017648 -0.0728475 -0.0611695 -0.1420081 -0.0286637 -0.0830629 -0.2320355 -0.0961708 -0.0130175 -0.0288562 -0.0816949 0.0335861 -0.1176655 0.0150139 0.0382945 0.039031 0.0312677 0.0559758 0.0826622 0.0090416 -0.0595491 -0.1012043 -0.1383069 0.0036462 0.0022479 -0.0044402 -0.1415577 -0.0440058 0.0648964 -0.0292726 0.0526686 0.0263173 -0.0235665 -0.0349361 -0.0392951 -0.1455739 -0.0405206 0.086319 -0.056569 0.0305799 0.0200962 -0.0452584 -0.0501205 -0.0499995 -0.1710123 0.5071441 -0.0071359 0.1941543 -0.0147687 0.4245049 -0.0933996 0.3341461 -0.0161792 0.3968048 -0.0505251 -0.023565 -0.0260811 0.0300946 0.141143 -0.0369676 -0.0229358 -0.0368394 -0.1316032 0.0399839 0.0384733 -0.059578 0.1018362 0.037572 -0.0506081 -0.0692364 -0.0339284 -0.1546084 -0.0729169 0.000418 -0.0273867 0.0105228 0.1293737 -0.0420035 -0.0269566 -0.0319549 -0.1538199 0.1006907 0.010785 -0.0710865 -0.0158994 -0.1004115 -0.0014425 -0.0689771 -0.0086661 -0.1460627 -0.1234175 0.025076 0.100182 0.0910145 0.0166558 -0.0939014 0.0662318 -0.0245944 0.0330726 0.0352758 0.0571176 -0.0971903 -0.0227429 -0.0593172 0.1140851 -0.0363261 0.0858169 -0.0037171 -0.1341036 0.0610822 0.066948 0.0358833 0.0818747 0.0062937 0.0565997 -0.0039433 0.1214065 0.009146 -0.1189916 0.049149 -0.0868061 -0.0229874 0.0304855 0.0452305 0.0480035 0.1199192 -0.0123413 -0.1214662 0.0569272 -0.0556265 -0.0131303 0.0331995 0.0506026 0.0515781 0.1382145 -0.1088269 -0.1547146 0.0089272 -0.1439225 -0.1754971 0.0832148 -0.0247661 0.0929004 -0.0098455 -0.0102845 0.0983881 0.0649211 0.0673855 0.0479317 -0.0152947 0.0808996 -0.0180838 -0.005816 0.0707992 0.0679829 0.0137803 0.0543233 -0.1298784 0.0144937 0.0190571 0.0181104 0.1519142 -0.0030207 -0.0557581 0.0450503 -0.1221609 -0.0246016 0.0511957 0.0553843 0.0348951 0.1366938 0.0670362 0.0611055 0.0147903 0.0748881 -0.1204748 0.0168238 0.0157543 0.0182847 0.152585 -0.1189448 0.0599044 0.062894 0.0613446 0.0741502 -0.0057364 0.0654011 -0.0070571 0.1467591 0.28804 0.1052435 0.1397479 0.1539309 0.2581417 -0.0194388 0.2339641 -0.0420233 0.1287795 unknown
polarizability: 168.3887684|-15.596776|156.3235576|-18.7773901|-4.5276563|69.7215756 unknown
InChI: InChI=1S/C12H12O/c13-9-8-11-6-3-5-10-4-1-2-7-12(10)11/h1-7,13H,8-9H2
charge 0 multiplicity 1
25 atoms
O  -3.461094 -0.670403 -1.206198
C  -1.03295 0.188567 0.556247
C  0.327269 -0.204163 0.253414
C  -2.0922 -0.84502 0.901663
C  1.293761 0.814784 -0.115563
C  -1.376961 1.54473 0.492304
C  0.77197 -1.569672 0.300661
C  0.887447 2.188509 -0.172325
C  -2.691639 -1.567658 -0.334977
C  -0.426029 2.547047 0.127774
C  2.642751 0.430188 -0.416316
C  2.092904 -1.91465 0.002825
C  3.039783 -0.906777 -0.361014
H  -2.919978 -0.356726 1.453823
H  -1.683813 -1.618269 1.581684
H  -2.405423 1.846971 0.722908
H  0.067237 -2.360326 0.578752
H  1.62438 2.949612 -0.455197
H  -3.322179 -2.417225 0.007094
H  -1.892453 -1.959426 -0.984497
H  -0.7373 3.596462 0.083722
H  3.362058 1.210811 -0.692366
H  2.40901 -2.962845 0.047984
H  4.07255 -1.188571 -0.593728
H  -4.1880 -0.255852 -0.675576
