program: Gaussian 09
title: 000168019
version: EM64L-G09RevD.01
frameworkgroup: C1[X(C5H13O2PS2)]
method: RPBEPBE
basis: SDD
operation: Freq
keyword: #p
keyword: freq=noraman
keyword: PBEPBE/SDD
title: #p freq=noraman PBEPBE/SDD
converged: YES YES NO NO
title: Mulliken charges:
elementType: S S P O O C C C C C H H H H H H H H H H H H H
charge: -0.030822 -0.030478 0.785342 -0.455608 -0.593624 -0.580981 -0.630459 -0.632049 -0.601550 -0.489497 0.294293 0.270973 0.269188 0.304866 0.228182 0.237604 0.229444 0.248953 0.227914 0.220441 0.237240 0.239871 0.250756
chargesum: 0.00000
title: Mulliken charges with hydrogens summed into heavy atoms:
elementType: S S P O O C C C C C
charge: -0.030822 -0.030478 0.785342 -0.455608 -0.593624 -0.015714 -0.056405 0.063182 0.095757 0.238370
polarizability: 1.72365559e+02 -1.81733301e-01 1.22692414e+02 -2.76166963e+00 -3.78200419e+00 1.02490312e+02
1716.lowfreq: -18.3424 -13.0908 -11.0838 -8.6208 -0.0025 -0.0015 0.0000 13.0500 40.9485
frequency: -16.1691 10.6214 40.6374 47.4598 73.4953 81.5227 121.3364 140.4160 145.8917 165.3701 197.7312 231.7590 233.1209 254.7063 272.6197 291.8036 324.6079 345.0378 408.7554 443.4264 581.4965 591.2753 621.4717 757.5761 781.8000 962.4424 981.2867 988.0366 1014.6954 1042.0871 1050.6830 1064.7152 1071.7847 1111.5108 1122.6457 1243.2597 1246.3528 1276.8662 1282.0849 1395.8253 1397.4283 1419.5220 1434.9535 1455.3890 1458.5699 1462.8450 1467.4543 1469.8432 1474.4778 1479.4176 2970.4332 2983.7408 2986.9697 3029.5906 3033.0557 3068.2174 3077.7920 3079.2926 3090.5805 3091.1776 3116.4469 3120.2693 3124.3621
redmass: 3.8370 3.8648 2.5307 2.0756 5.0189 3.4414 3.3448 1.6274 2.3305 3.3932 3.3542 2.0628 1.5576 1.8875 3.6724 4.6544 3.7270 5.4780 8.6551 24.9476 5.2483 4.8439 10.5595 1.1547 1.1140 10.9809 1.7068 1.7693 11.6075 1.2557 1.3125 2.1910 2.3933 1.2507 1.2950 1.2226 1.2024 1.2146 1.2048 1.2041 1.1988 1.1190 1.0861 1.0490 1.0863 1.0403 1.0392 1.0533 1.0459 1.0469 1.0307 1.0374 1.0360 1.0592 1.0583 1.1049 1.0959 1.0977 1.1021 1.1029 1.1054 1.1079 1.1012
irintensity: 2.2398 1.1677 0.3117 1.2784 0.7321 5.1576 5.2302 6.5608 3.7253 0.4529 3.6872 2.8012 2.3978 1.7333 2.8029 2.6961 7.4388 1.8416 18.1956 212.0744 11.3135 7.6978 119.5631 9.2775 8.7739 110.5164 23.8405 26.6050 69.2136 0.1619 3.2590 12.9752 2.6775 0.0461 0.4321 4.8204 5.2967 29.2981 18.1040 18.7807 18.9360 7.0785 15.8746 8.9272 12.2281 15.0143 16.4905 15.9923 7.2434 8.2964 38.6723 24.6744 29.1871 9.7946 10.7892 23.4788 25.0139 22.9353 7.7782 7.9029 10.7532 21.9972 10.3059
temp: 298.150 k
press: 1.00000 atm
elementType: 16 16 15 8 8 6 6 6 6 6 1 1 1 1 1 1 1 1 1 1 1 1 1
symmnumber: 1
zpe: 468398.1 jmol-1
zpe.correction: 0.178403 hartree
zpe.thermalcorrener: 0.193411 hartree
zpe.thermalcorrenthalpy: 0.194355 hartree
zpe.thermalcorrgfe: 0.133449 hartree
zpe.sumelectzpe: -1485.275205 hartree
zpe.sumelectthermal: -1485.260197 hartree
zpe.sumelectthermalent: -1485.259253 hartree
zpe.sumelectthermalfe: -1485.320159 hartree
dipole: -0.9030 0.1963 -1.7801
dipole: 2.0057
quadrupole: -70.4923 -77.0884 -94.5869
quadrupole: -2.5736 -0.6479 -3.5134
quadrupole: 10.2303 3.6341 -13.8644 -2.5736 -0.6479 -3.5134
hfenergy: -1485.453608 hartree
pointgroup: C01 [X(C5H13O2P1S2)]
dipole: 0.3373763 0.0836706 0.7084207 debye
dipolederiv: -0.7243683 0.190168 -0.0965046 0.1613886 -0.3602619 -0.0137035 -0.1298614 0.1400537 -0.2832285 -0.7252276 -0.1801383 0.0222738 -0.0176384 -0.3938834 0.0017027 0.169809 0.0402322 -0.2579803 2.029522 0.0941194 0.0789555 -0.1640644 1.5313079 -0.0580901 0.1240438 -0.4885594 1.0688635 -0.6410135 -0.1932603 -0.0416182 -0.0713817 -1.2570017 -0.0971671 -0.0808679 -0.0850631 -0.5328146 -0.7158572 -0.001498 0.0027322 0.0262531 -0.5602413 -0.0512342 -0.0486177 0.0089825 -0.6788344 0.4460562 -0.1373205 -0.0956837 -0.064322 0.1484943 0.0614173 -0.4210079 0.1425673 0.0360503 0.2127897 0.1739717 0.0393735 0.3664596 0.3970783 0.0368409 0.1730964 0.0976606 0.0592304 -0.1651589 0.1389882 -0.0199533 0.0461907 -0.0015429 0.0391416 0.2157439 -0.0775466 0.0666818 -0.0409085 -0.0328166 -0.010988 -0.0512665 -0.162408 0.0360217 -0.0968017 -0.025208 0.0399183 0.2611985 -0.0007181 0.0255164 0.0102964 0.4742116 0.0770662 0.0872477 0.4467001 0.2557777 0.0108126 0.0058844 -0.054194 0.0027431 0.0655582 -0.025061 0.0214542 -0.0532172 -0.0262342 -0.0753628 -0.0146638 0.0531406 -0.035906 -0.0769266 0.0419166 0.094494 0.0225064 0.0467828 -0.0910594 0.0405462 -0.0102555 -0.053589 -0.0038058 -0.0174968 -0.0194058 -0.0318521 0.1088725 0.1201447 -0.0249773 0.0459885 -0.0831728 -0.0029594 0.0078922 -0.0390656 0.0179521 -0.0396395 0.0931543 -0.0277573 -0.0575079 -0.0512938 0.0624468 -0.0880837 -0.1301231 -0.0318824 -0.0688041 0.0627949 -0.1387769 0.0278581 -0.0802818 -0.05173 0.0357595 -0.0115561 0.0575923 0.0856189 -0.096249 0.0995933 0.0922996 0.1365386 0.0544502 -0.0166368 0.0982968 -0.021888 0.0170578 -0.0735487 0.0830573 0.0243789 0.0522499 0.0928686 0.0120442 0.0461329 0.0013566 0.0759048 0.1013452 0.0048078 0.0359683 0.0383142 0.079077 -0.009688 0.0677383 0.0648908 -0.1154015 0.0126971 -0.0978756 -0.0757242 -0.1599321 -0.0723548 -0.0625521 -0.0846794 -0.0644919 0.0518927 -0.0059723 0.0261087 -0.091779 0.0583459 0.06472 0.061772 -0.0961479 -0.0726514 -0.0278447 -0.082575 0.0721838 0.0795689 0.0039168 0.0708618 -0.0122973 0.0413141 -0.1116698 0.0413047 0.0867859 -0.0796262 0.0261538 -0.0698486 -0.0979587 0.0404356 0.0187634 0.0235352 0.0768253 unknown
polarizability: 171.7742763|-5.8350365|123.796662|0.5293565|2.3931944|101.9773462 unknown
InChI: InChI=1S/2C2H5S.CH3O2P/c2*1-2-3;1-3-4-2/h2*2H2,1H3;1H3
charge 0 multiplicity 1
23 atoms
S  1.193279 0.082944 1.129826
S  -2.249722 1.158221 0.791087
P  -0.297925 0.905012 -0.42062
O  0.239796 2.522748 -0.784101
O  -0.422471 0.048064 -1.758245
C  2.581298 -0.395455 -0.107096
C  -3.240094 -0.157283 -0.188025
C  3.456243 -1.477257 0.54014
C  -2.977295 -1.58168 0.308559
C  0.333902 3.501647 0.317416
H  2.082038 -0.761491 -1.019635
H  3.151278 0.517855 -0.337964
H  -4.287107 0.158073 -0.038553
H  -2.972942 -0.034712 -1.250574
H  3.921039 -1.122343 1.477017
H  2.869914 -2.384635 0.764976
H  4.269481 -1.755366 -0.156425
H  -1.928793 -1.875826 0.130471
H  -3.190587 -1.680274 1.386784
H  -3.626493 -2.291134 -0.240273
H  1.029198 3.147065 1.101484
H  -0.664209 3.700259 0.750985
H  0.726073 4.414769 -0.154233
