program: Gaussian 09
title: 000001228
version: EM64L-G09RevD.01
frameworkgroup: C1[X(C8H17N2O5P)]
method: RPBEPBE
basis: SDD
operation: Freq
keyword: #p
keyword: freq=noraman
keyword: PBEPBE/SDD
title: #p freq=noraman PBEPBE/SDD
converged: YES YES NO NO
title: Mulliken charges:
elementType: P O O O O O N N C C C C C C C C H H H H H H H H H H H H H H H H H
charge: 1.239158 -0.412267 -0.229823 -0.673949 -0.678151 -0.622172 -0.080129 -0.297757 -0.383696 -0.328298 -0.166024 -0.316134 -0.463640 -0.343557 -0.766330 0.134045 0.181269 0.239854 0.205206 0.178185 0.266978 0.206299 0.178438 0.219773 0.221419 0.239383 0.240930 0.284145 0.278056 0.285860 0.382094 0.389947 0.390891
chargesum: 0.00000
title: Mulliken charges with hydrogens summed into heavy atoms:
elementType: P O O O O O N N C C C C C C C C
charge: 1.239158 -0.030174 -0.229823 -0.284002 -0.287260 -0.622172 -0.080129 -0.013612 0.037427 0.055093 0.100953 0.068603 -0.022448 0.136756 -0.202414 0.134045
polarizability: 1.75193372e+02 -1.29173220e+00 1.30255663e+02 -5.55667138e+00 -2.07507765e+00 1.13015937e+02
1716.lowfreq: -6.6218 -2.2187 0.0011 0.0013 0.0016 3.7466 12.5395 23.6423 39.7326
frequency: 10.5615 23.4954 39.7317 51.0182 69.6461 86.6414 101.8870 118.5655 134.0502 167.8380 193.2507 202.2368 230.8415 256.3378 294.9991 310.3043 321.5597 338.6355 342.3398 354.7590 373.8252 392.7980 439.8477 479.1759 488.0026 557.2569 582.1687 609.8557 616.7030 647.6710 693.1297 723.1174 735.2712 765.8827 786.4114 836.4889 855.1319 908.9809 931.1120 973.4483 982.6308 986.3383 1005.4839 1031.1546 1038.8552 1045.4524 1056.0890 1061.0836 1093.6085 1099.1353 1123.5726 1147.7032 1160.8562 1199.2607 1212.2058 1228.1094 1255.1893 1269.6996 1274.2804 1289.9701 1302.0043 1312.6156 1322.8703 1337.3197 1348.3391 1357.7947 1362.8516 1389.4047 1421.3157 1447.5444 1449.6952 1458.5922 1463.3673 1472.6518 1486.2019 1660.8651 2832.3990 2835.7026 2852.7239 2992.1779 3009.1515 3012.5341 3019.5302 3025.1892 3045.1309 3047.5799 3067.2599 3071.3856 3098.4354 3465.1611 3512.2228 3591.7895 3595.6493
redmass: 6.4803 6.1500 6.8506 6.3021 3.9726 2.4437 4.3648 3.7824 2.4971 2.2968 5.2033 3.2615 2.8877 2.2548 3.1070 3.1816 2.6866 4.4404 3.6704 3.6096 1.4403 2.1981 4.6688 3.7766 3.6985 1.8738 1.4508 1.9244 2.4035 6.3306 3.6478 8.3752 2.0711 1.5941 2.6551 1.5356 2.4711 2.4652 2.3238 2.8958 2.1576 1.2052 2.4770 2.5826 1.8562 3.2738 2.6597 1.9935 2.4442 2.6366 2.1872 2.1153 1.8011 1.3206 1.8904 1.4968 1.2817 1.3442 1.3490 1.1976 1.3293 1.3756 1.2132 1.3690 1.6493 1.3381 1.2951 1.3946 1.0775 1.1341 1.1051 1.1537 1.1156 1.0865 1.0900 8.6414 1.0705 1.0702 1.0693 1.0631 1.0797 1.0677 1.0834 1.0580 1.0875 1.0901 1.1016 1.1031 1.1045 1.0752 1.0640 1.0660 1.0662
irintensity: 0.2466 0.3355 0.7893 0.4072 0.3097 0.3127 1.7948 2.7166 8.1054 10.9026 1.9217 2.0474 5.3058 6.7387 16.1770 38.8137 38.5852 31.5271 110.1927 94.7263 73.4327 14.2415 5.2252 14.1656 15.7792 25.1162 34.9752 117.1767 122.3855 115.5278 65.0301 256.8898 20.5613 59.4491 14.0681 9.2448 5.9255 18.3237 2.7026 6.5083 1.6069 35.3350 77.8669 53.9749 26.6052 9.4746 86.5806 77.8820 114.7260 44.0085 61.9028 20.8214 18.5537 40.1725 17.4178 1.4986 17.4896 6.4082 8.0101 6.6160 7.6583 25.4850 21.8673 6.5992 29.0645 4.1700 25.6473 4.9733 8.1229 4.8950 13.1734 5.2535 6.1427 1.9188 14.7274 235.5184 44.1516 46.4868 190.0550 44.2880 11.3578 11.3410 11.9872 13.1508 49.7346 28.4845 35.1563 12.5061 11.1358 9.1314 26.5276 56.2885 42.8074
temp: 298.150 k
press: 1.00000 atm
elementType: 15 8 8 8 8 8 7 7 6 6 6 6 6 6 6 6 1 1 1 1 1 1 1 1 1 1 1 1 1 1 1 1 1
symmnumber: 1
zpe: 689486.3 jmol-1
zpe.correction: 0.262611 hartree
zpe.thermalcorrener: 0.281220 hartree
zpe.thermalcorrenthalpy: 0.282164 hartree
zpe.thermalcorrgfe: 0.212750 hartree
zpe.sumelectzpe: -1140.591633 hartree
zpe.sumelectthermal: -1140.573025 hartree
zpe.sumelectthermalent: -1140.572080 hartree
zpe.sumelectthermalfe: -1140.641494 hartree
dipole: -1.2239 -0.2838 -2.0824
dipole: 2.4320
quadrupole: -107.9688 -95.1181 -113.5595
quadrupole: -13.6782 3.2674 3.9056
quadrupole: -2.4201 10.4307 -8.0107 -13.6782 3.2674 3.9056
hfenergy: -1140.8542445 hartree
pointgroup: C01 [X(C8H17N2O5P1)]
dipole: 0.4792214 -0.2325813 0.7948491 debye
polarizability: 175.2301606|1.5722779|129.2793895|-5.2838229|4.4816274|113.9554221 unknown
InChI: InChI=1S/C8H17N2O5P/c11-8(12)7-6-10(4-2-9-7)3-1-5-16(13,14)15/h7,9,11,13-14H,1-6H2
charge 0 multiplicity 1
33 atoms
P  4.700108 -0.319393 -0.275134
O  -4.364329 -1.940224 -1.000561
O  -5.219464 -0.429542 0.544705
O  5.828072 -1.130424 0.768054
O  4.7686 1.358225 0.176359
O  4.965422 -0.56769 -1.828653
N  -0.6192 0.108948 0.073826
N  -3.215883 1.41487 -0.124429
C  -1.854663 -0.692892 0.247311
C  -0.800058 1.483236 0.610243
C  -3.031247 0.00991 -0.513645
C  0.582516 -0.581115 0.600435
C  -1.957555 2.185225 -0.142387
C  1.887754 -0.063314 -0.044759
C  3.107224 -0.812774 0.529162
C  -4.316777 -0.756835 -0.256456
H  -2.137386 -0.801851 1.327788
H  -1.693398 -1.700349 -0.176317
H  0.133367 2.055809 0.46548
H  -1.021726 1.460379 1.710167
H  -2.788945 -0.04739 -1.591363
H  0.4784 -1.659416 0.369541
H  0.65547 -0.495045 1.715919
H  -2.146961 3.182947 0.291955
H  -1.64658 2.3265 -1.195463
H  2.010583 1.019159 0.13798
H  1.818368 -0.205618 -1.138901
H  -3.774419 1.50949 0.733636
H  3.022299 -1.90509 0.386211
H  3.238368 -0.619163 1.608266
H  -5.199831 -2.435874 -0.78166
H  6.708595 -1.310984 0.350555
H  5.343575 1.911287 -0.411266
