program: Gaussian 09
title: 000167900
version: EM64L-G09RevD.01
frameworkgroup: C1[X(C5H11NS)]
method: RPBEPBE
basis: SDD
operation: Freq
keyword: #p
keyword: freq=noraman
keyword: PBEPBE/SDD
title: #p freq=noraman PBEPBE/SDD
converged: YES YES NO NO
title: Mulliken charges:
elementType: S N C C C C C H H H H H H H H H H H
charge: 0.196055 -0.055802 -0.406530 -0.401472 -0.674570 -0.588497 -0.652798 0.244654 0.212504 0.211730 0.245359 0.212842 0.277856 0.236181 0.264146 0.231799 0.229277 0.217267
chargesum: 0.00000
title: Mulliken charges with hydrogens summed into heavy atoms:
elementType: S N C C C C C
charge: 0.196055 -0.055802 0.050628 0.055617 -0.183872 -0.088170 0.025545
polarizability: 1.01301771e+02 -4.94716956e+00 7.48214420e+01 2.70084551e+00 2.73831927e-01 5.70815086e+01
1716.lowfreq: -21.3883 -7.9772 -0.0029 -0.0019 0.0024 14.2032 37.0245 56.2032 85.4248
frequency: 32.8068 56.0152 85.3049 176.7332 213.7627 238.2978 292.3898 346.6961 415.3647 623.1276 678.0757 715.9102 788.9570 789.9833 808.6637 918.8079 973.2060 988.5845 1000.2953 1028.0494 1056.0137 1072.2408 1076.0075 1109.6445 1140.6737 1221.5331 1239.4093 1248.1739 1269.4980 1292.8923 1395.1215 1428.6007 1454.6825 1461.6512 1469.6496 1471.3414 1484.1183 2893.8057 2984.2335 3005.3041 3047.9338 3059.8751 3071.4842 3072.4998 3078.1202 3099.8772 3164.3395 3182.4184
redmass: 3.0135 1.9269 3.2115 3.0065 3.2293 1.1419 3.3977 2.6038 3.2872 4.0835 3.8435 4.8033 1.8183 1.4308 1.5020 1.4693 1.3483 1.6984 2.0273 1.2033 1.2373 2.0229 1.3713 1.6882 1.3947 1.1596 1.2407 2.9257 1.3362 1.2248 1.2051 1.0790 1.0779 1.0861 1.0429 1.1734 1.0478 1.0686 1.0354 1.0586 1.0526 1.0618 1.0919 1.1028 1.0986 1.1041 1.1131 1.1146
irintensity: 2.7627 0.4803 0.5475 0.7327 0.2633 0.0274 1.9303 3.7870 0.4649 0.6155 18.2229 14.9176 10.9618 4.7905 3.3080 9.8063 32.1280 33.1497 13.9385 1.0923 11.5600 0.2758 11.7765 9.1707 0.3628 5.1014 1.4012 53.1420 18.3662 13.8076 17.2352 9.9375 5.0747 4.6124 11.6790 10.2229 8.1193 77.9638 35.8302 23.5069 28.1145 33.6637 12.6241 0.1740 29.4365 50.9595 2.5516 37.6017
temp: 298.150 k
press: 1.00000 atm
elementType: 16 7 6 6 6 6 6 1 1 1 1 1 1 1 1 1 1 1
symmnumber: 1
zpe: 399087.2 jmol-1
zpe.correction: 0.152004 hartree
zpe.thermalcorrener: 0.161078 hartree
zpe.thermalcorrenthalpy: 0.162022 hartree
zpe.thermalcorrgfe: 0.116713 hartree
zpe.sumelectzpe: -649.291365 hartree
zpe.sumelectthermal: -649.282291 hartree
zpe.sumelectthermalent: -649.281347 hartree
zpe.sumelectthermalfe: -649.326657 hartree
dipole: 0.8247 2.0290 2.2235
dipole: 3.1210
quadrupole: -47.2865 -51.0240 -53.3302
quadrupole: -2.5938 1.9424 -1.7561
quadrupole: 3.2604 -0.4771 -2.7833 -2.5938 1.9424 -1.7561
hfenergy: -649.4433696 hartree
pointgroup: C01 [X(C5H11N1S1)]
dipole: 0.3070746 0.7031529 0.9586402 debye
dipolederiv: -0.4076815 0.0086823 0.0339529 0.1049245 -0.1380772 0.0682001 0.006566 0.065346 -0.1397518 -0.6042991 -0.3151471 -0.0135119 -0.4405574 -0.3835313 -0.035593 0.0529042 -0.0288519 -0.3645055 0.0382594 0.0266603 -0.0761146 0.0632413 0.0191566 0.0135504 -0.0389876 0.0050004 0.2206858 0.0497761 0.0820503 0.0007988 0.0939371 0.0800434 -0.0441699 -0.005569 -0.0506823 0.2065583 0.8838507 0.2358834 -0.0047541 0.3012049 0.2413262 -0.0804904 -0.1308623 -0.1087994 0.3070785 0.1060713 -0.1585666 -0.0869653 -0.2111618 0.2579971 0.0150624 -0.109055 0.009836 0.1417401 -0.0593988 0.0069799 -0.025623 0.1559666 0.0101964 0.003143 0.0457125 -0.0253117 0.0641194 -0.1267967 0.0011141 0.0553612 0.0007945 0.112008 0.0138873 0.0789404 0.0098703 0.0264572 0.0225832 0.0039853 -0.0000165 0.0167263 0.0839768 0.0848643 -0.096702 0.0754507 -0.1207358 0.0555113 0.0484187 0.1120228 0.0277183 0.0027452 -0.0076655 0.1003074 -0.0825382 -0.0875496 0.1069296 0.0327997 0.010293 -0.0210072 -0.0711434 0.0733104 0.0243259 0.1026484 0.0105826 -0.121561 -0.0510656 -0.0198624 -0.06273 0.0295387 -0.1025344 0.0331952 0.0452458 -0.2423101 -0.032071 0.0660377 -0.0080353 0.0028001 -0.0937025 0.0124968 0.0157087 0.0073127 0.0995671 0.0150889 0.021581 -0.0783076 0.0568278 -0.015316 -0.0472152 -0.048253 -0.0675108 -0.1512407 -0.0142151 -0.0544003 0.0575629 -0.0369303 -0.1280859 0.0411192 0.0693825 0.0340247 0.0302554 0.0789582 0.0041313 -0.0225557 -0.0403725 0.1094091 -0.0342742 -0.0868494 -0.0030188 -0.1288464 0.0237821 -0.054586 0.049072 -0.1401009 -0.0114142 0.0965314 0.0606179 0.0869045 0.0347966 -0.0147876 0.0954417 0.0166828 0.1287185 -0.1051271 -0.0702229 0.0286175 -0.0749261 0.0930988 unknown
polarizability: 101.290363|-5.0839768|74.5081308|2.7678097|2.072957|57.4062275 unknown
InChI: InChI=1S/C5H11NS/c1-2-7-5-6-3-4-6/h2-5H2,1H3
charge 0 multiplicity 1
18 atoms
S  -1.181793 -1.152789 -0.39356
N  1.480125 -0.248496 -0.539724
C  2.794021 0.106495 0.130047
C  1.695371 1.148764 -0.01608
C  0.586432 -1.119643 0.255101
C  -1.792737 0.540105 0.212758
C  -3.306579 0.640435 -0.025661
H  3.663209 0.118982 -0.533974
H  2.985608 -0.278111 1.142343
H  1.170793 1.449741 0.902749
H  1.772351 1.927061 -0.781498
H  0.540722 -0.855481 1.338269
H  0.934096 -2.161529 0.152349
H  -1.551841 0.621931 1.288562
H  -1.249323 1.321753 -0.343107
H  -3.548397 0.536918 -1.098591
H  -3.851221 -0.145507 0.526965
H  -3.681937 1.623972 0.313352
