program: Gaussian 09
title: 000013039
version: EM64L-G09RevD.01
frameworkgroup: C1[X(C7H7FN2O)]
method: RPBEPBE
basis: SDD
operation: Freq
keyword: #p
keyword: freq=noraman
keyword: PBEPBE/SDD
title: #p freq=noraman PBEPBE/SDD
converged: NO YES NO YES
title: Mulliken charges:
elementType: F O N N C C C C C C C H H H H H H H
charge: -0.208756 -0.284283 -0.478857 -0.660140 0.525836 -0.488317 -0.467747 0.359864 -0.152412 -0.406049 0.274633 0.333530 0.216652 0.293586 0.230064 0.256379 0.349806 0.306211
chargesum: 0.00000
title: Mulliken charges with hydrogens summed into heavy atoms:
elementType: F O N N C C C C C C C
charge: -0.208756 -0.284283 -0.185270 -0.004123 0.525836 -0.154787 -0.251095 0.359864 0.077652 -0.149670 0.274633
polarizability: 1.41217741e+02 1.53877632e+00 1.00072362e+02 4.26087919e-04 9.96819021e-05 3.83954223e+01
1716.lowfreq: -6.6028 0.0004 0.0004 0.0009 5.0176 9.6635 49.0294 79.5456 145.4829
frequency: 49.0227 79.5439 145.4817 218.6096 231.6317 301.4391 301.5421 347.2543 422.2695 452.0705 503.8855 504.1746 546.6510 582.5535 605.5510 662.8104 684.9633 713.0557 750.4594 777.6738 862.6191 907.9395 920.8441 954.6362 979.5183 994.8134 1043.7709 1085.4388 1133.3561 1177.4612 1264.7712 1273.4622 1315.0171 1396.0599 1439.0186 1479.0035 1516.1540 1594.9633 1612.6967 1627.1578 1663.7183 3118.2897 3153.2527 3185.6626 3196.1992 3533.9334 3544.3190 3696.6279
redmass: 4.8934 4.3250 7.2930 3.2361 3.2576 1.5359 8.0351 4.8096 5.3633 3.0069 8.9230 1.1439 3.6934 1.4555 2.7010 6.2670 2.0264 9.5798 6.6941 1.5408 1.4483 1.4278 3.7689 1.3168 4.8796 3.5253 1.8820 1.5354 1.9056 1.1605 1.4811 2.4487 2.4405 7.6081 3.5647 2.7221 2.4438 3.0686 1.6836 4.9033 3.7904 1.0891 1.0927 1.0969 1.0934 1.0675 1.0541 1.1041
irintensity: 16.4827 0.4676 4.0859 1.3253 0.2221 30.7584 7.8652 1.1281 1.5068 30.2003 4.8311 282.7868 15.9144 43.6584 19.5282 2.2441 45.4132 25.4211 17.7864 81.4239 0.8170 55.2373 16.3709 1.4081 1.5803 25.3271 30.1224 6.2513 42.6153 0.1840 57.4695 32.2643 198.9054 78.3313 190.6712 26.1084 558.8366 127.2921 62.1503 86.6535 284.7118 14.3595 15.5278 2.6591 20.1200 18.6250 52.8979 42.6729
temp: 298.150 k
press: 1.00000 atm
elementType: 9 8 7 7 6 6 6 6 6 6 6 1 1 1 1 1 1 1
symmnumber: 1
zpe: 350214.8 jmol-1
zpe.correction: 0.133390 hartree
zpe.thermalcorrener: 0.143231 hartree
zpe.thermalcorrenthalpy: 0.144175 hartree
zpe.thermalcorrgfe: 0.097683 hartree
zpe.sumelectzpe: -554.744740 hartree
zpe.sumelectthermal: -554.734898 hartree
zpe.sumelectthermalent: -554.733954 hartree
zpe.sumelectthermalfe: -554.780446 hartree
dipole: -3.2914 5.9226 -0.0001
dipole: 6.7757
quadrupole: -45.8374 -62.3783 -67.5194
quadrupole: -4.3578 0.0003 0.0002
quadrupole: 12.7410 -3.8000 -8.9410 -4.3578 0.0003 0.0002
hfenergy: -554.8781295 hartree
pointgroup: C01 [X(C7H7F1N2O1)]
dipole: 1.1888386 -2.3859986 -0.0000368 debye
dipolederiv: -0.4127231 0.3109826 -0.0000024 0.41359 -0.9193021 0.0000097 -0.0000049 0.0000073 -0.1588268 -0.7509515 0.0233357 -0.0000037 -0.1616465 -1.0253399 -0.0000147 -0.0000235 -0.0000511 -0.3824989 -1.9155866 -0.2638834 -0.0000125 -0.6263043 -0.438673 -0.0000213 -0.0000208 -0.0000221 -0.3591534 -1.5037196 0.2418283 0.0000165 0.3457393 -0.3380838 0.0000292 -0.0000165 0.0000325 -0.788932 1.5272915 0.0029735 -0.000021 -0.2137716 0.1304173 -0.0000095 -0.0000331 -0.0000048 0.1235054 -0.5053543 0.1273201 0.0000007 0.2498336 -0.1928309 -0.0000023 0.0000109 0.0000037 -0.1868795 -0.4432176 -0.0119 -0.0000008 -0.2539468 -0.0200114 -0.0000011 0.0000092 -0.000003 -0.249311 0.6710827 -0.2665866 -0.0000064 -0.4348423 1.1001931 -0.0000155 0. -0.0000099 0.1062147 0.2478849 -0.0498022 -0.0000045 -0.025061 0.181971 -0.0000064 -0.000014 -0.00001 -0.1223623 -0.1864158 -0.0981533 -0.0000015 0.0892769 -0.3595737 0.0000039 -0.000003 0.000006 -0.2059372 2.5139514 -0.0234243 0.0000413 0.5794741 1.4635962 0.0000422 0.000084 0.0000589 0.3495206 0.2117832 -0.0334823 0.0000042 -0.0025724 0.0975883 0.0000031 0.0000075 -0.0000003 0.2067588 0.0156827 0.1146881 0.0000011 0.0897085 -0.0685673 0.000005 0.0000038 0.0000037 0.1789292 0.1193289 -0.0133247 -0.0000003 0.0054455 0.0744839 -0.0000054 0.0000084 0.0000035 0.3224889 0.0162327 -0.0897118 0.0000045 -0.101574 -0.0453097 0.0000061 0.0000061 0.0000076 0.1567487 -0.0503896 0.025755 0.0000047 0.0217973 0.0989609 0.0000015 0.0000059 0.0000004 0.1940007 0.2469382 0.0085433 -0.0000079 0.0392664 0.1683825 -0.0000094 -0.0000049 -0.0000087 0.4047422 0.1981819 -0.0051581 -0.000012 -0.0144128 0.0920987 -0.0000151 -0.0000151 -0.0000137 0.4109919 unknown
polarizability: 141.2727853|-0.3162027|100.0173181|-0.0004301|-0.0000804|38.3954223 unknown
InChI: InChI=1S/C7H7FN2O/c8-5-2-1-3-6(4-5)10-7(9)11/h1-4,10H,9H2
charge 0 multiplicity 1
18 atoms
F  -2.437681 2.110946 -0.000015
O  2.338097 1.431516 0.000089
N  1.510551 -0.785495 -0.000051
N  3.818731 -0.362335 0.000039
C  0.108597 -0.564324 -0.000014
C  -0.467627 0.733583 -0.000031
C  -0.734805 -1.712594 0.000029
C  -1.867367 0.821332 -0.000002
C  -2.135941 -1.566706 0.000049
C  -2.733081 -0.285283 0.000039
C  2.533567 0.18158 0.000001
H  0.162178 1.624842 -0.000057
H  -0.292297 -2.716623 0.000045
H  1.790604 -1.767952 -0.00007
H  -2.771171 -2.458647 0.000082
H  -3.81682 -0.144436 0.000061
H  4.588738 0.302077 0.000105
H  4.027328 -1.358381 0.000002
