program: Gaussian 09
title: 000167855
version: EM64L-G09RevD.01
frameworkgroup: C1[X(C20H14O2)]
method: RPBEPBE
basis: SDD
operation: Freq
keyword: #pfreq=noraman
keyword: PBEPBE/SDD
title: #p freq=noraman PBEPBE/SDD
converged: YES YES NO NO
title: Mulliken charges:
elementType: O O C C C C C C C C C C C C C C C C C C C C H H H H H H H H H H H H H H
charge: -0.449137 -0.230004 0.100255 0.100077 0.315711 0.243628 0.107014 0.263618 -0.008810 0.418922 -0.433507 -0.637575 -0.508278 -0.387242 -0.400439 -0.380215 -0.447427 -0.267529 -0.208053 -0.251288 -0.264103 -0.248335 0.230713 0.258551 0.238053 0.238776 0.274261 0.314622 0.322004 0.243691 0.229841 0.177495 0.233260 0.230765 0.232454 0.348230
chargesum: 0.00000
title: Mulliken charges with hydrogens summed into heavy atoms:
elementType: O O C C C C C C C C C C C C C C C C C C C C
charge: -0.100907 -0.230004 0.100255 0.100077 0.315711 0.243628 0.107014 0.263618 -0.008810 0.418922 -0.202794 -0.140971 -0.269503 -0.112980 -0.085817 -0.058211 -0.203736 -0.037688 -0.030558 -0.018027 -0.033338 -0.015882
polarizability: 4.14621109e+02 5.71837644e+00 2.68344653e+02 2.53895027e+00 2.87277933e+00 9.46434616e+01
1716.lowfreq: -7.6012 -0.0006 -0.0004 0.0005 3.2110 7.4909 41.2087 54.5172 101.9987
frequency: 41.1949 54.5066 101.9981 106.3229 113.0009 142.0041 151.9153 190.5951 196.9444 248.4406 260.4788 286.5508 307.5257 314.0569 346.0422 357.8043 368.3746 407.9113 414.1921 443.6786 454.4602 514.9865 521.5401 523.8428 552.3911 573.1467 590.1596 614.5389 625.5438 657.5481 681.3144 707.8481 739.4094 769.1457 771.7762 787.3253 795.5154 812.5884 824.2754 851.1145 881.0948 893.7140 900.7198 935.2422 960.1960 966.1051 971.4552 976.0339 985.3559 995.3642 1011.7745 1021.5865 1035.0931 1052.0154 1066.6589 1077.7268 1109.8957 1150.5366 1179.9630 1183.9188 1184.5965 1196.4016 1217.5791 1237.8740 1250.0754 1273.4930 1292.5444 1321.2693 1342.0001 1365.7524 1374.7234 1394.6990 1404.9971 1413.3179 1429.4643 1431.5472 1439.5919 1457.7283 1488.9485 1503.3898 1508.1904 1539.9805 1547.7892 1564.4741 1579.4740 1608.6592 1614.1663 1627.2877 2939.1652 2978.4876 3033.1330 3118.3893 3125.1758 3129.6522 3131.3046 3139.5936 3149.6422 3161.1262 3169.3701 3174.4477 3186.9185 3542.2927
redmass: 5.9600 5.5424 4.3488 3.3888 4.2393 6.6131 3.8686 4.2544 5.0027 5.8785 6.3700 5.5302 1.1462 3.7671 5.8684 5.0560 3.3089 4.3530 3.4561 4.4571 4.1087 4.0627 4.5759 4.1860 4.8669 5.2228 3.5869 5.2246 6.0175 4.6673 4.4824 3.7044 4.3237 1.2817 1.4949 3.6282 4.7936 5.5983 1.9609 2.2593 4.1227 1.9722 1.4695 4.9744 2.1372 3.5128 1.4133 1.4943 1.4320 2.4665 1.3466 1.6469 2.6094 1.9588 2.0120 3.8545 2.2765 1.6439 1.3205 1.1283 1.1368 1.2097 1.1367 1.9228 1.6241 2.5752 1.7583 2.0882 3.9060 3.7454 3.5868 4.5296 1.5160 1.8314 3.4479 2.9096 1.7933 2.1898 2.0545 2.4959 1.3853 6.6563 6.2082 6.5713 5.9414 6.0329 5.7364 6.4272 1.0828 1.0582 1.1042 1.0891 1.0893 1.0890 1.0864 1.0938 1.0918 1.1003 1.0969 1.0938 1.0955 1.0663
irintensity: 0.8995 0.9035 1.0926 8.0525 1.3448 3.0135 7.1251 2.6948 1.0732 2.0811 7.5791 2.3475 94.5515 6.6337 1.3521 1.5555 6.7911 5.6865 2.9194 0.4889 2.5043 0.8449 3.3616 4.2838 9.0879 15.1286 2.1821 6.0383 2.8347 4.4964 12.2753 6.5689 31.5580 32.3133 63.8482 17.0599 15.2733 1.3946 61.0024 19.2700 3.3147 12.0601 5.8129 32.4003 2.9917 11.3030 2.9622 3.7630 4.2042 21.4208 3.1412 19.9761 8.5728 6.5519 7.9689 10.0169 7.7234 12.0084 34.4579 8.0356 9.7960 22.0823 4.5092 9.2019 3.4297 46.3561 22.5073 11.1606 7.6297 27.3060 13.0874 3.2984 13.6237 8.7369 7.9176 31.5929 11.4952 5.0216 6.7032 23.3527 22.0525 75.0366 5.3327 78.8356 174.7334 15.8019 4.8167 1.2384 82.7801 44.8757 20.3981 7.7744 8.3075 10.2329 7.4083 7.9516 21.1611 49.9684 20.1175 16.1360 18.5412 3.4168
temp: 298.150 k
press: 1.00000 atm
elementType: 8 8 6 6 6 6 6 6 6 6 6 6 6 6 6 6 6 6 6 6 6 6 1 1 1 1 1 1 1 1 1 1 1 1 1 1
symmnumber: 1
zpe: 730710.0 jmol-1
zpe.correction: 0.278313 hartree
zpe.thermalcorrener: 0.295238 hartree
zpe.thermalcorrenthalpy: 0.296182 hartree
zpe.thermalcorrgfe: 0.234229 hartree
zpe.sumelectzpe: -919.487063 hartree
zpe.sumelectthermal: -919.470138 hartree
zpe.sumelectthermalent: -919.469194 hartree
zpe.sumelectthermalfe: -919.531147 hartree
dipole: 3.8535 -3.4427 1.6753
dipole: 5.4321
quadrupole: -118.9900 -112.6156 -132.7269
quadrupole: 13.0985 0.6460 -3.9506
quadrupole: 2.4542 8.8286 -11.2828 13.0985 0.6460 -3.9506
hfenergy: -919.7653757 hartree
pointgroup: C01 [X(C20H14O2)]
dipole: 1.4528237 1.4639166 -0.5601011 debye
polarizability: 414.8494346|1.2866111|267.0428319|-1.4559344|13.9729354|95.7169567 unknown
InChI: InChI=1S/C20H14O2/c21-11-18-15-7-3-4-8-16(15)19(12-22)20-14-6-2-1-5-13(14)9-10-17(18)20/h1-11,22H,12H2
charge 0 multiplicity 1
36 atoms
O  0.235739 3.453492 0.503309
O  -3.145523 -3.261998 -0.066763
C  0.54996 0.066595 -0.126848
C  -0.336303 1.175216 -0.246255
C  -0.01271 -1.279413 -0.191744
C  -1.757287 0.984664 -0.122558
C  2.012803 0.21781 0.014713
C  -2.319852 -0.350405 -0.010838
C  -1.431816 -1.487204 -0.099015
C  2.867735 -0.909702 -0.248766
C  0.904624 -2.378231 -0.457119
C  0.156405 2.547334 -0.673284
C  2.267306 -2.191289 -0.539663
C  -2.639754 2.120032 -0.070642
C  -3.743976 -0.479901 0.149273
C  2.628283 1.416586 0.492814
C  4.284148 -0.777858 -0.156142
C  -4.01465 1.958145 0.084787
C  -1.936749 -2.880648 -0.02473
C  -4.568292 0.645283 0.192255
C  4.02667 1.522605 0.598801
C  4.866619 0.432812 0.245861
H  0.509891 -3.377653 -0.650443
H  1.147499 2.461381 -1.155609
H  -0.554104 2.965938 -1.413004
H  2.924633 -3.034799 -0.781577
H  -2.212954 3.126141 -0.081626
H  -4.169226 -1.482039 0.218755
H  2.003337 2.244735 0.845053
H  4.911862 -1.649111 -0.3779
H  -4.668944 2.834661 0.145849
H  -1.155794 -3.658233 0.122663
H  -5.649708 0.519754 0.31578
H  4.469014 2.449421 0.980801
H  5.955143 0.527036 0.322721
H  0.476672 4.362141 0.185789
