program: Gaussian 09
title: 000167753
version: EM64L-G09RevD.01
frameworkgroup: C1[X(C10H13NO2S)]
method: RPBEPBE
basis: SDD
operation: Freq
keyword: #p
keyword: freq=noraman
keyword: PBEPBE/SDD
title: #p freq=noraman PBEPBE/SDD
converged: YES YES NO NO
title: Mulliken charges:
elementType: S O O N C C C C C C C C C C H H H H H H H H H H H H H
charge: 0.176660 -0.361026 -0.253320 -0.370700 -0.202032 0.417899 -0.162158 -0.231945 -0.355085 -0.340550 -0.588942 -0.648315 0.268431 -0.601932 0.241736 0.254868 0.247170 0.247957 0.247553 0.264472 0.231703 0.229755 0.222137 0.332678 0.272231 0.230236 0.230517
chargesum: 0.00000
title: Mulliken charges with hydrogens summed into heavy atoms:
elementType: S O O N C C C C C C C C C C
charge: 0.176660 -0.361026 -0.253320 -0.038022 -0.202032 0.417899 0.079578 0.022923 -0.107916 -0.092593 -0.076916 0.035281 0.268431 0.131052
polarizability: 2.26557670e+02 -6.17213970e-01 1.14805602e+02 9.08173839e+00 -3.11302230e+00 9.13532089e+01
1716.lowfreq: -47.7157 -26.1139 -16.0653 -6.9946 -3.4283 -0.0024 -0.0021 -0.0020 34.4136
frequency: -47.7082 -26.0220 34.3356 39.3414 50.0827 87.3860 95.2332 152.2905 169.3215 220.8893 236.5084 251.0368 280.5392 314.6749 360.9760 397.6963 409.4673 463.3283 496.5378 587.3210 615.3830 628.8748 643.3408 654.0518 685.6881 721.0665 785.3963 793.1119 822.8619 840.5873 880.7380 948.4048 962.1770 993.1286 1001.2447 1025.2960 1063.4786 1066.7850 1074.0150 1097.8446 1126.8792 1145.5370 1158.3963 1174.5589 1215.0914 1235.3370 1270.8638 1282.1731 1358.2538 1392.4066 1395.8096 1430.7123 1456.3837 1456.8593 1469.6795 1471.7172 1483.2059 1483.3076 1514.7472 1585.0719 1595.5105 1708.4471 2980.6501 2986.8208 3025.1063 3059.0946 3080.0284 3082.3282 3109.1255 3112.4027 3142.0987 3149.4655 3166.8836 3171.9576 3576.3942
redmass: 4.4606 2.8398 2.6078 4.3075 4.5604 4.7123 1.1169 3.2908 5.7033 4.6977 1.1157 6.1945 4.2611 5.2455 5.5585 5.3130 2.8994 7.4891 3.2217 1.1096 4.8036 6.5417 4.9161 6.6972 12.1753 3.6625 1.1144 4.6987 1.2771 1.7979 4.0448 1.3790 1.3701 1.8800 3.3956 1.1916 3.6270 2.7565 3.0852 1.3258 1.2814 1.7892 1.8671 1.4790 2.5423 1.2564 1.2556 1.2472 5.4842 4.0009 1.2050 1.1574 1.4856 1.0906 1.0412 1.9502 1.0479 1.0439 1.4020 7.8811 6.3775 9.6560 1.0352 1.0353 1.0573 1.1027 1.1022 1.0990 1.1071 1.0984 1.0887 1.0885 1.0967 1.0978 1.0772
irintensity: 1.6914 1.1583 0.5062 5.0818 1.0751 1.3685 0.2928 2.4602 1.2868 0.8965 0.0919 1.1747 9.0667 0.4021 17.9302 2.2657 0.8042 0.8025 30.2570 130.4251 3.4253 1.2757 3.1036 8.4959 23.1830 0.9948 9.7320 0.5236 2.9930 37.0455 96.6205 1.8681 0.2706 47.8158 39.5965 2.8129 124.7382 113.7245 26.3616 12.4719 0.0175 182.2268 244.2714 184.1854 7.5817 0.5369 22.7293 1.2524 0.4155 3.9901 19.5971 29.1900 294.2457 11.7106 15.6227 36.3698 8.1552 15.0980 135.4907 1.6686 0.3914 292.1392 87.8145 35.3437 16.9084 36.4531 5.5695 25.0092 41.8313 4.1877 7.8247 5.3745 10.5188 3.2476 41.9529
temp: 298.150 k
press: 1.00000 atm
elementType: 16 8 8 7 6 6 6 6 6 6 6 6 6 6 1 1 1 1 1 1 1 1 1 1 1 1 1
symmnumber: 1
zpe: 556285.9 jmol-1
zpe.correction: 0.211878 hartree
zpe.thermalcorrener: 0.225667 hartree
zpe.thermalcorrenthalpy: 0.226612 hartree
zpe.thermalcorrgfe: 0.169522 hartree
zpe.sumelectzpe: -991.077412 hartree
zpe.sumelectthermal: -991.063622 hartree
zpe.sumelectthermalent: -991.062678 hartree
zpe.sumelectthermalfe: -991.119768 hartree
dipole: -1.4933 -2.1408 -3.0065
dipole: 3.9815
quadrupole: -61.8939 -85.2041 -95.5330
quadrupole: -1.6957 4.5291 -3.9418
quadrupole: 18.9831 -4.3271 -14.6560 -1.6957 4.5291 -3.9418
hfenergy: -991.2892899 hartree
pointgroup: C01 [X(C10H13N1O2S1)]
dipole: -0.5739599 0.6962757 1.2804237 debye
polarizability: 226.4597712|0.837477|115.1901669|-9.7945324|-0.1147424|91.0665425 unknown
InChI: InChI=1S/C10H13NO2S/c1-3-14-9-6-4-8(5-7-9)13-10(12)11-2/h4-7,11H,3H2,1-2H3
charge 0 multiplicity 1
27 atoms
S  3.712026 -0.645258 -0.760089
O  -2.103367 0.190804 0.811732
O  -2.94434 -0.247814 -1.373111
N  -4.339539 0.278012 0.452493
C  1.955403 -0.362108 -0.276635
C  -0.752961 -0.008161 0.391327
C  1.353804 0.913886 -0.402886
C  1.186711 -1.461094 0.177234
C  -0.002086 1.097029 -0.057589
C  -0.176825 -1.288343 0.503526
C  4.594851 0.615792 0.369769
C  6.110192 0.48211 0.164782
C  -3.139268 0.042834 -0.172449
C  -5.615738 0.212039 -0.2638
H  1.935021 1.758988 -0.786473
H  1.656416 -2.444407 0.27856
H  -0.480296 2.077065 -0.148944
H  -0.784326 -2.12945 0.851249
H  4.239937 1.624392 0.100289
H  4.298268 0.391333 1.407544
H  6.461354 -0.531579 0.427056
H  6.3922 0.684264 -0.883932
H  6.643104 1.206382 0.807995
H  -4.311714 0.504821 1.446749
H  -5.40339 -0.04536 -1.313607
H  -6.14119 1.184471 -0.237996
H  -6.276348 -0.56465 0.163609
