program: Gaussian 09
title: 000167752
version: EM64L-G09RevD.01
frameworkgroup: C1[X(C20H16O2)]
method: RPBEPBE
basis: SDD
operation: Freq
keyword: #pfreq=noraman
keyword: PBEPBE/SDD
title: #p freq=noraman PBEPBE/SDD
converged: YES YES NO YES
title: Mulliken charges:
elementType: O O C C C C C C C C C C C C C C C C C C C C H H H H H H H H H H H H H H H H
charge: -0.452709 -0.443170 0.119091 0.326768 0.120557 -0.016572 0.211609 0.307622 0.173837 0.190751 -0.413837 -0.642777 -0.458621 -0.833402 -0.381458 -0.440048 -0.418463 0.119554 -0.272298 -0.265751 -0.243175 -0.435700 0.251464 0.255147 0.230650 0.272713 0.235797 0.238297 0.239592 0.272788 0.226816 0.325458 0.226626 0.226592 0.225298 0.219374 0.341339 0.360244
chargesum: 0.00000
title: Mulliken charges with hydrogens summed into heavy atoms:
elementType: O O C C C C C C C C C C C C C C C C C C C C
charge: -0.111371 -0.082926 0.119091 0.326768 0.120557 -0.016572 0.211609 0.307622 0.173837 0.190751 -0.162373 -0.156980 -0.185908 -0.119717 -0.108670 -0.213232 -0.093005 0.119554 -0.045673 -0.039159 -0.017877 -0.216326
polarizability: 4.18468685e+02 -6.47624426e+00 2.57707671e+02 -1.99644497e+00 -1.22352559e+00 9.90955793e+01
1716.lowfreq: -7.2763 -0.0002 0.0004 0.0009 1.5459 8.0494 43.4163 60.8362 83.4833
frequency: 43.3793 60.8328 83.4819 103.0424 135.9154 138.8839 144.4555 163.1867 203.9963 245.3338 254.3692 268.2888 292.3122 308.4412 319.8977 346.6028 351.4546 367.0806 399.1761 410.9508 427.0260 475.3967 487.3311 491.8985 506.7643 525.1334 547.4760 572.9152 581.8308 591.3933 617.6261 641.4994 662.4167 696.8728 711.5199 755.2847 765.6936 770.0453 791.8609 806.4689 823.4327 844.1820 846.1582 886.0860 896.3169 899.4139 927.5361 948.8270 956.7994 985.0822 989.8756 1003.1009 1020.1933 1036.5161 1039.1082 1053.4425 1063.4863 1076.6186 1093.0624 1132.9570 1172.9761 1180.6758 1182.4674 1192.3446 1211.6844 1215.1490 1244.3242 1254.4770 1269.5482 1296.8993 1324.9461 1347.5837 1371.0382 1383.6871 1397.7917 1399.9318 1403.6413 1423.0334 1434.3937 1438.3878 1457.1663 1472.3314 1480.5778 1497.3099 1503.9151 1509.8855 1552.0331 1564.7616 1571.2626 1611.0668 1616.4421 1629.5688 2971.5469 2982.3643 3026.6257 3050.6994 3114.1839 3120.1370 3127.2169 3128.6035 3143.5881 3151.9046 3156.4406 3161.3833 3170.2106 3180.2961 3534.5828 3587.5899
redmass: 4.4782 3.4312 3.4139 2.5556 2.1923 6.3307 2.8810 3.4540 4.1925 5.3080 4.3077 6.5179 5.0944 1.1675 3.2719 3.0122 1.2020 3.3028 3.4982 4.5465 3.7007 5.3388 4.1341 4.3800 4.3033 4.5171 5.2245 5.0288 3.6023 4.5101 4.7635 5.5314 3.9073 3.8528 3.6422 3.4434 1.9221 1.7802 1.8212 4.4547 2.3346 4.6573 1.7076 3.1984 1.4600 2.8840 4.7420 3.6652 1.4019 1.3431 1.3115 1.4623 2.0761 1.7911 2.5771 2.0476 2.1030 2.8258 2.1114 1.6429 1.4546 1.1784 1.1724 1.2128 1.7537 1.1451 1.6188 2.0988 1.8678 2.2075 2.8090 4.0447 2.8217 4.4078 2.2931 1.7489 1.4070 2.6090 3.0587 3.6362 2.3262 1.5032 1.0489 1.4129 2.0758 1.8732 6.0355 5.8040 7.7323 6.6553 5.9664 6.3628 1.0586 1.0419 1.1039 1.0973 1.0880 1.0929 1.0857 1.0923 1.0893 1.0985 1.0859 1.0936 1.0983 1.0973 1.0662 1.0660
irintensity: 0.2464 0.4813 0.7712 2.0896 5.8836 2.6902 2.5765 0.7363 5.0053 3.3067 7.4059 1.3302 1.6652 105.0811 13.2439 7.4078 115.9350 3.2332 0.1123 6.1521 4.2013 0.3827 4.3377 2.7464 2.1025 2.5592 4.5498 3.2183 4.1657 1.3453 3.7400 4.7231 10.4786 9.4931 10.8166 23.4384 1.7548 91.3980 44.3904 4.3946 3.1267 30.3052 30.4960 29.0455 6.0323 34.8097 31.6958 8.8041 1.6652 0.1416 1.1268 8.6188 1.9871 27.6084 91.1970 3.9026 11.4511 1.9326 13.2286 93.5627 5.2605 24.7969 16.3552 24.0975 43.9213 2.7481 17.2141 52.0879 32.6355 3.9824 6.8067 7.2212 5.5681 12.1514 18.1650 12.4084 8.6723 5.9123 3.9181 2.6014 57.0674 4.6067 12.9100 20.4740 13.9718 15.6612 31.9607 7.8082 24.3961 21.4334 6.1056 9.4119 51.6359 31.8406 21.3991 16.3922 25.4166 17.9809 1.7621 10.1688 11.2028 30.6309 5.4822 25.3184 46.2609 12.7505 2.5434 48.7635
temp: 298.150 k
press: 1.00000 atm
elementType: 8 8 6 6 6 6 6 6 6 6 6 6 6 6 6 6 6 6 6 6 6 6 1 1 1 1 1 1 1 1 1 1 1 1 1 1 1 1
symmnumber: 1
zpe: 788389.3 jmol-1
zpe.correction: 0.300282 hartree
zpe.thermalcorrener: 0.318097 hartree
zpe.thermalcorrenthalpy: 0.319041 hartree
zpe.thermalcorrgfe: 0.255668 hartree
zpe.sumelectzpe: -920.672795 hartree
zpe.sumelectthermal: -920.654980 hartree
zpe.sumelectthermalent: -920.654036 hartree
zpe.sumelectthermalfe: -920.717409 hartree
dipole: -1.2289 1.0621 1.2762
dipole: 2.0657
quadrupole: -100.1961 -108.5986 -135.1467
quadrupole: -5.6621 1.7623 5.9828
quadrupole: 14.4510 6.0485 -20.4996 -5.6621 1.7623 5.9828
hfenergy: -920.973077 hartree
pointgroup: C01 [X(C20H16O2)]
dipole: 0.4819552 0.4187669 -0.5028308 debye
polarizability: 418.4889389|5.5410502|257.6074281|-4.5160429|2.3977997|99.1755682 unknown
InChI: InChI=1S/C20H16O2/c1-12-13-5-2-3-6-15(13)18(11-21)20-14(12)9-10-16-17(20)7-4-8-19(16)22/h2-10,21-22H,11H2,1H3
charge 0 multiplicity 1
38 atoms
O  -0.569643 3.405175 0.321765
O  4.942442 -1.328402 -0.247685
C  0.217832 0.051445 -0.072041
C  -0.146644 -1.361912 -0.018864
C  -0.81742 1.012582 -0.256357
C  -1.50729 -1.774891 0.066534
C  -2.189814 0.616328 -0.095849
C  -2.542935 -0.783839 0.099919
C  1.647606 0.409747 0.04116
C  2.640673 -0.622099 -0.109435
C  0.910141 -2.353773 -0.118809
C  -0.543286 2.406239 -0.785588
C  2.238149 -2.004282 -0.226442
C  -1.8277 -3.262162 0.105546
C  -3.243066 1.599181 -0.104973
C  -3.935626 -1.11184 0.279264
C  2.0889 1.727901 0.382553
C  4.026906 -0.274785 -0.053653
C  -4.577152 1.239754 0.069146
C  -4.927488 -0.134302 0.262074
C  3.458184 2.031014 0.455859
C  4.442472 1.040806 0.206927
H  0.639423 -3.412526 -0.133751
H  0.439123 2.433085 -1.292883
H  -1.323638 2.668822 -1.527199
H  3.017148 -2.762582 -0.340924
H  -2.90351 -3.463163 0.198295
H  -1.484817 -3.767117 -0.81739
H  -1.326248 -3.761347 0.955545
H  -2.978186 2.65717 -0.183703
H  -4.230754 -2.151159 0.44488
H  1.356514 2.491448 0.662528
H  -5.358176 2.007982 0.082083
H  -5.976555 -0.414333 0.408575
H  3.774463 3.043357 0.72994
H  5.509874 1.292495 0.255646
H  -0.458881 4.310222 -0.0707
H  5.871478 -1.001038 -0.160693
