program: Gaussian 09
title: 000167749
version: EM64L-G09RevD.01
frameworkgroup: C1[X(C20H16O2)]
method: RPBEPBE
basis: SDD
operation: Freq
keyword: #pfreq=noraman
keyword: PBEPBE/SDD
title: #p freq=noraman PBEPBE/SDD
converged: YES YES NO NO
title: Mulliken charges:
elementType: O O C C C C C C C C C C C C C C C C C C C C H H H H H H H H H H H H H H H H
charge: -0.437185 -0.429302 0.142007 0.323678 0.010389 -0.060186 0.276776 0.249797 0.131086 0.466453 -0.464497 -0.517258 -0.497887 -0.877404 -0.406538 -0.395390 -0.333612 -0.631004 -0.265164 -0.267246 -0.399382 0.284489 0.229186 0.234282 0.210647 0.228507 0.274717 0.225129 0.241382 0.250355 0.293693 0.265133 0.235030 0.227477 0.229975 0.254347 0.341486 0.356038
chargesum: 0.00000
title: Mulliken charges with hydrogens summed into heavy atoms:
elementType: O O C C C C C C C C C C C C C C C C C C C C
charge: -0.095700 -0.073265 0.142007 0.323678 0.010389 -0.060186 0.276776 0.249797 0.131086 0.466453 -0.235311 -0.282976 -0.058733 -0.136176 -0.156183 -0.101697 -0.068479 -0.395975 -0.037687 -0.037271 -0.145036 0.284489
polarizability: 4.28706739e+02 1.98772061e+01 2.48331841e+02 -2.17759442e+00 -1.13668132e+01 1.04422227e+02
1716.lowfreq: -0.0002 0.0003 0.0004 3.1896 6.8390 10.7337 45.7978 49.4993 68.3835
frequency: 45.7875 49.4981 68.3612 91.7056 114.3561 144.5870 176.8238 188.5365 230.9575 243.6795 277.5539 278.3227 287.9937 307.0379 347.5586 355.7229 374.0139 381.6520 390.5512 400.6474 420.9371 452.6910 465.3845 504.0932 509.1633 520.4827 545.6939 549.5582 581.2843 592.0760 619.5723 632.1488 658.4787 693.7477 715.1116 753.0685 764.1449 769.2359 774.0736 785.9946 813.6247 831.1601 854.8836 864.8069 867.0575 903.2271 932.8152 945.2277 961.2518 966.5072 970.8575 988.6364 1002.1628 1012.7684 1034.7920 1038.0359 1071.6110 1075.0011 1113.7170 1133.3708 1150.3717 1163.4170 1181.9672 1184.2198 1198.1216 1243.6175 1258.1489 1274.5134 1297.4432 1301.9291 1307.0226 1345.9169 1366.6277 1373.0956 1378.8754 1397.9728 1401.1888 1408.4527 1428.7782 1433.4146 1458.9689 1474.8760 1484.3762 1500.1842 1505.9410 1513.0472 1556.5868 1561.5986 1575.6408 1615.2897 1616.7606 1632.7750 2970.7405 3025.7798 3053.6404 3075.4361 3103.4772 3108.4089 3125.3970 3128.5123 3145.6420 3164.1914 3164.2459 3166.3214 3173.2553 3197.3317 3560.7096 3579.7189
redmass: 5.9440 4.2935 4.9361 3.9623 4.6953 4.6094 4.1047 3.7795 4.3511 4.4703 2.2547 1.4666 1.9931 3.5763 3.9744 2.5480 1.1559 2.4199 4.5722 3.8638 3.7726 3.3138 3.7585 3.8747 6.0080 4.5725 3.9333 4.1546 4.2727 4.2119 3.7512 5.5153 4.9550 3.3099 5.8963 2.7744 3.1245 1.9065 3.6361 2.0330 2.2297 1.6694 4.1494 1.7923 1.5880 3.3137 5.0070 2.7368 1.3735 1.4423 1.3975 1.3312 3.0441 2.2931 1.6482 2.1116 2.0184 4.4610 2.1371 1.6106 1.3943 1.2498 1.2884 1.1843 1.2760 1.5872 1.9084 1.3802 1.8477 3.1328 2.0045 3.6699 2.6653 1.3961 3.2016 1.2612 3.6364 3.3024 3.1458 5.7945 2.6869 1.3795 1.4835 1.4838 1.7830 1.4104 6.2573 5.5281 6.8576 6.4182 5.9564 6.7543 1.0438 1.0605 1.0918 1.1028 1.0969 1.0915 1.0884 1.0857 1.0901 1.0939 1.0903 1.0937 1.0982 1.0936 1.0665 1.0660
irintensity: 0.1463 0.4268 2.7123 1.0155 0.4622 0.6838 0.6049 3.6867 0.9769 2.8292 0.3036 82.5245 38.5672 2.2313 8.6982 25.3826 137.9928 10.3506 0.7940 7.2810 2.5957 7.3610 11.5910 22.6488 14.5541 3.3579 4.4496 3.3631 1.3830 4.1056 0.2971 0.3515 1.4125 16.0076 3.5706 25.0338 0.9911 77.2155 4.5309 6.0277 1.8968 24.3602 4.3602 57.7630 1.9086 96.6925 34.6163 11.3131 3.9609 4.9913 1.5170 0.2051 3.9887 7.6418 3.7827 5.8665 2.4839 2.6479 17.2010 301.4291 53.7838 34.9818 13.9706 1.2777 10.7967 7.5172 20.5886 12.0634 13.1046 36.2598 4.4609 1.9506 13.0663 28.9212 4.0904 13.1346 0.5681 34.6065 1.9679 4.5503 39.9181 11.1909 5.9562 29.8859 19.4281 22.5405 3.5307 10.6528 6.7220 46.5630 86.6657 38.2665 28.2305 57.2997 20.0907 17.8535 10.4992 22.7531 8.3912 4.2721 16.7390 16.1077 6.2963 29.3911 25.9105 7.4778 8.6292 67.5642
temp: 298.150 k
press: 1.00000 atm
elementType: 8 8 6 6 6 6 6 6 6 6 6 6 6 6 6 6 6 6 6 6 6 6 1 1 1 1 1 1 1 1 1 1 1 1 1 1 1 1
symmnumber: 1
zpe: 788206.0 jmol-1
zpe.correction: 0.300212 hartree
zpe.thermalcorrener: 0.317987 hartree
zpe.thermalcorrenthalpy: 0.318931 hartree
zpe.thermalcorrgfe: 0.255402 hartree
zpe.sumelectzpe: -920.673185 hartree
zpe.sumelectthermal: -920.655410 hartree
zpe.sumelectthermalent: -920.654465 hartree
zpe.sumelectthermalfe: -920.717995 hartree
dipole: 1.9450 -0.0177 -0.5736
dipole: 2.0279
quadrupole: -120.7694 -117.1641 -132.3519
quadrupole: 18.7010 -0.8745 -3.2882
quadrupole: 2.6591 6.2643 -8.9234 18.7010 -0.8745 -3.2882
hfenergy: -920.9733967 hartree
pointgroup: C01 [X(C20H16O2)]
dipole: 0.7638268 0.0409106 0.2268318 debye
polarizability: 429.9086244|-13.0562384|246.4480407|3.8400145|-14.9148788|105.1041415 unknown
InChI: InChI=1S/C20H16O2/c1-12-15-4-2-3-5-17(15)19(11-21)18-8-6-13-10-14(22)7-9-16(13)20(12)18/h2-10,21-22H,11H2,1H3
charge 0 multiplicity 1
38 atoms
O  -2.891561 -3.20408 -0.961796
O  6.024928 0.594243 -0.38115
C  0.305003 0.204373 0.124754
C  -0.285112 -1.134843 0.241494
C  -0.557627 1.337241 0.193801
C  -1.69557 -1.319912 0.183796
C  -1.980766 1.152111 0.063016
C  -2.548907 -0.182356 -0.006245
C  1.772479 0.304458 -0.025919
C  2.602707 -0.839654 0.254464
C  0.610066 -2.257043 0.481565
C  1.976147 -2.109896 0.549396
C  -2.340967 -2.689501 0.319586
C  -0.055667 2.741714 0.508848
C  -2.876972 2.275727 -0.032609
C  -3.967521 -0.327654 -0.206562
C  2.439133 1.46328 -0.537456
C  4.021517 -0.754615 0.159717
C  -4.248471 2.102486 -0.214007
C  -4.799721 0.785452 -0.307063
C  3.833243 1.538756 -0.655228
C  4.634356 0.433917 -0.267353
H  0.187552 -3.253329 0.632595
H  2.615703 -2.973745 0.76605
H  -1.654378 -3.437251 0.750874
H  -3.224222 -2.639903 0.977174
H  0.937966 2.719177 0.980415
H  0.005732 3.39835 -0.381831
H  -0.743598 3.230542 1.220628
H  -2.473548 3.291354 0.002923
H  -4.386116 -1.331213 -0.320406
H  1.855234 2.308275 -0.903642
H  4.623419 -1.642974 0.394283
H  -4.904852 2.975414 -0.301662
H  -5.875208 0.655072 -0.470168
H  4.322078 2.430747 -1.057032
H  -2.209308 -3.073754 -1.668728
H  6.500531 -0.226465 -0.099622
