program: Gaussian 09
title: 000167750
version: EM64L-G09RevD.01
frameworkgroup: C1[X(C20H16O2)]
method: RPBEPBE
basis: SDD
operation: Freq
keyword: #pfreq=noraman
keyword: PBEPBE/SDD
title: #p freq=noraman PBEPBE/SDD
converged: YES YES NO NO
title: Mulliken charges:
elementType: O O C C C C C C C C C C C C C C C C C C C C H H H H H H H H H H H H H H H H
charge: -0.433916 -0.442087 0.119346 0.334376 0.010679 -0.058812 0.276532 0.252020 0.208588 0.181012 -0.432147 -0.460406 -0.499542 -0.877211 -0.406719 -0.382717 -0.396649 0.124955 -0.266309 -0.269379 -0.237051 -0.434734 0.233343 0.274467 0.213878 0.223580 0.225277 0.276416 0.240093 0.249353 0.277803 0.266385 0.227487 0.229954 0.227055 0.222440 0.340632 0.362010
chargesum: 0.00000
title: Mulliken charges with hydrogens summed into heavy atoms:
elementType: O O C C C C C C C C C C C C C C C C C C C C
charge: -0.093283 -0.080077 0.119346 0.334376 0.010679 -0.058812 0.276532 0.252020 0.208588 0.181012 -0.198804 -0.185939 -0.062084 -0.135425 -0.157366 -0.104914 -0.130264 0.124955 -0.038823 -0.039426 -0.009997 -0.212295
polarizability: 4.21427846e+02 7.06978323e+00 2.49744694e+02 3.99335894e+00 -2.16710644e-01 1.02503503e+02
1716.lowfreq: -9.4521 -1.9701 -0.0005 0.0002 0.0003 4.6537 43.8934 52.4774 65.5898
frequency: 43.8785 52.4743 65.5876 83.7404 115.4434 156.1029 161.8413 205.8195 231.1002 255.1774 267.3143 270.2550 277.7089 290.0608 333.3818 358.2468 367.2958 371.4496 407.3374 416.8203 427.9799 470.7855 490.4319 500.6373 503.5535 518.0737 546.0947 568.5301 580.8218 593.8581 610.4662 630.3694 648.6791 690.6222 703.7475 753.5116 757.7055 764.2219 778.3968 797.2442 808.0535 829.4130 845.5111 866.2559 875.2189 896.8999 915.5867 950.7253 958.5710 963.2005 983.6106 988.1327 1010.3057 1034.4597 1038.9426 1043.2990 1070.5561 1074.8802 1089.2539 1133.4160 1158.0295 1175.1343 1180.3048 1184.8274 1212.1047 1241.1091 1248.5181 1254.8671 1279.7122 1296.6166 1309.7093 1342.1144 1365.5322 1373.1872 1379.9634 1396.1710 1401.5625 1417.4050 1429.6947 1435.4669 1450.3202 1474.0996 1484.8846 1496.5606 1506.0023 1518.8261 1553.4242 1560.3647 1570.6727 1609.9095 1615.1233 1629.1176 2971.5137 3023.9746 3054.9200 3068.8066 3106.4790 3118.2500 3128.9659 3146.5333 3148.9347 3152.1304 3165.4474 3176.4501 3179.0805 3201.0504 3562.6237 3588.3027
redmass: 4.7671 5.2311 5.0196 4.4088 4.2660 3.9359 4.7605 3.9242 4.1221 2.9673 3.6454 3.9620 1.3756 1.9060 4.1208 1.1743 2.5946 3.3689 2.1706 4.2054 3.7915 4.9385 3.4833 5.5999 4.4116 4.2068 5.3609 4.5289 4.5770 3.7909 4.2517 5.9442 5.1968 3.5438 3.9992 2.2288 2.6849 1.4559 2.5538 3.7308 4.4441 1.8438 4.6140 1.6616 1.3984 3.0944 4.1628 3.8145 1.3975 1.3319 1.3243 1.3335 2.4039 1.6123 2.0971 2.9045 2.0768 3.4675 2.1988 1.6892 1.1668 1.3159 1.2348 1.1176 1.7100 1.6637 1.8488 2.1736 1.3981 1.8960 2.7242 3.8530 3.1216 1.3895 3.8391 1.2868 4.2548 2.4440 2.9528 3.8959 2.5731 1.4324 1.4975 2.4755 1.2913 1.2353 6.3773 5.6010 7.5385 6.8077 6.0332 6.5595 1.0438 1.0599 1.0920 1.1030 1.0966 1.0887 1.0857 1.0903 1.0939 1.0860 1.0948 1.0972 1.0970 1.0928 1.0665 1.0660
irintensity: 0.1525 0.4095 1.6193 0.2860 0.0724 0.5200 2.6452 10.9908 2.7658 18.8747 1.6797 1.4010 77.6069 31.4141 9.5981 124.5414 15.6641 6.5960 3.1761 1.3507 4.5557 0.6962 5.9124 5.2823 4.8124 4.0121 3.7919 3.9643 2.3697 1.7996 1.7865 3.2356 1.6298 1.0903 4.6549 36.2519 9.8873 99.8891 18.5981 12.3915 12.7101 29.3579 27.8280 1.8368 1.3906 80.2129 89.5211 20.3576 4.1111 1.7459 1.2156 0.1128 1.1292 7.6101 3.2198 62.0627 0.0112 14.2724 6.1966 110.4445 34.8613 11.4713 10.5609 2.8590 48.2408 3.3059 40.9246 49.4077 11.3465 20.6858 11.3421 10.4352 6.0280 38.0826 1.0500 16.7965 15.5220 4.3473 6.7226 4.3579 46.9208 13.0207 6.4057 7.7512 25.3209 6.8744 23.8357 3.5744 36.2705 23.2165 13.7401 9.0298 27.5407 53.1989 20.5553 17.7897 8.6906 18.1506 4.0632 17.4205 21.8213 8.6005 25.5109 22.6646 11.7408 8.9075 8.9222 52.0945
temp: 298.150 k
press: 1.00000 atm
elementType: 8 8 6 6 6 6 6 6 6 6 6 6 6 6 6 6 6 6 6 6 6 6 1 1 1 1 1 1 1 1 1 1 1 1 1 1 1 1
symmnumber: 1
zpe: 788266.4 jmol-1
zpe.correction: 0.300235 hartree
zpe.thermalcorrener: 0.318019 hartree
zpe.thermalcorrenthalpy: 0.318963 hartree
zpe.thermalcorrgfe: 0.255396 hartree
zpe.sumelectzpe: -920.672122 hartree
zpe.sumelectthermal: -920.654338 hartree
zpe.sumelectthermalent: -920.653394 hartree
zpe.sumelectthermalfe: -920.716961 hartree
dipole: 3.0643 -2.5076 -0.0231
dipole: 3.9595
quadrupole: -104.8505 -122.1710 -131.7656
quadrupole: 5.3690 0.4225 -0.6586
quadrupole: 14.7452 -2.5753 -12.1700 5.3690 0.4225 -0.6586
hfenergy: -920.9723571 hartree
pointgroup: C01 [X(C20H16O2)]
dipole: 1.1678258 1.0308606 0.0164077 debye
polarizability: 421.6719975|-0.5615514|249.4427612|-5.4815344|1.4585509|102.561285 unknown
InChI: InChI=1S/C20H16O2/c1-12-13-5-2-3-6-14(13)18(11-21)17-10-9-15-16(20(12)17)7-4-8-19(15)22/h2-10,21-22H,11H2,1H3
charge 0 multiplicity 1
38 atoms
O  -2.692951 -3.360411 -0.673484
O  4.96749 -1.315986 -0.296671
C  0.342003 0.356998 -0.018453
C  -0.102401 -1.036139 0.08771
C  -0.635199 1.37492 -0.22106
C  -1.481803 -1.352121 0.242773
C  -2.033352 1.059696 -0.062132
C  -2.457937 -0.302642 0.207189
C  1.796759 0.626946 0.071237
C  2.722463 -0.461452 -0.105036
C  0.893394 -2.086753 -0.063393
C  2.232327 -1.814524 -0.227449
C  -1.946851 -2.780327 0.471307
C  -0.28471 2.770227 -0.726427
C  -3.044422 2.083432 -0.134833
C  -3.863249 -0.574665 0.366528
C  2.337239 1.905209 0.417775
C  4.129299 -0.207091 -0.07152
C  -4.395014 1.790951 0.047457
C  -4.810349 0.44396 0.293206
C  3.723722 2.120583 0.478919
C  4.637032 1.073409 0.201194
H  0.567177 -3.129698 -0.090277
H  2.957413 -2.616288 -0.388681
H  -1.110048 -3.443521 0.749501
H  -2.67372 -2.818882 1.299672
H  -0.294877 3.540385 0.070224
H  0.706411 2.79046 -1.202399
H  -1.019144 3.084917 -1.488157
H  -2.748995 3.121654 -0.308048
H  -4.192871 -1.606023 0.513848
H  1.672997 2.721424 0.701002
H  -5.141401 2.591763 0.001986
H  -5.874745 0.215522 0.415609
H  4.106897 3.108123 0.756861
H  5.718874 1.254721 0.233567
H  -2.194704 -3.158004 -1.505622
H  5.918547 -1.053277 -0.231022
