program: Gaussian 09
title: 000167704
version: EM64L-G09RevD.01
frameworkgroup: C1[X(O4P)]
method: RPBEPBE
basis: SDD
operation: Freq
keyword: #pfreq=noraman
keyword: PBEPBE/SDD
title: #p freq=noraman PBEPBE/SDD
converged: YES YES YES YES
title: Mulliken charges:
elementType: P O O O O
charge: 1.186262 -1.046582 -1.046566 -1.046556 -1.046558
chargesum: -3.00000
title: Mulliken charges with hydrogens summed into heavy atoms:
polarizability: 3.63685532e+01 1.57913419e-03 3.63706745e+01 -2.43735982e-04 1.71394724e-04 3.63699937e+01
1716.lowfreq: -7.3893 -0.0008 0.0024 0.0026 15.6467 17.9622 308.9402 308.9952 435.4221
frequency: 308.9401 308.9952 435.4215 435.5630 435.7779 644.4507 814.0474 814.1847 814.2345
redmass: 15.9949 15.9949 17.1201 17.1202 17.1194 15.9949 21.6173 21.6194 21.6196
irintensity: 0.0001 0.0000 23.5779 23.5805 23.5440 0.0000 337.4858 337.4987 337.5055
temp: 298.150 k
press: 1.00000 atm
elementType: 15 8 8 8 8
symmnumber: 1
zpe: 29976.1 jmol-1
zpe.correction: 0.011417 hartree
zpe.thermalcorrener: 0.016257 hartree
zpe.thermalcorrenthalpy: 0.017201 hartree
zpe.thermalcorrgfe: -0.016895 hartree
zpe.sumelectzpe: -641.295721 hartree
zpe.sumelectthermal: -641.290881 hartree
zpe.sumelectthermalent: -641.289937 hartree
zpe.sumelectthermalfe: -641.324033 hartree
dipole: -0.0006 0.0005 0.0001
dipole: 0.0008
quadrupole: -59.9944 -59.9939 -59.9934
quadrupole: 0.0002 0.0000 0.0000
quadrupole: -0.0005 0.0000 0.0005 0.0002 0.0000 0.0000
hfenergy: -641.307138 hartree
pointgroup: C01[X(O4P1)]
dipole: -0.0002973 -0.0000389 0.0000473 debye
dipolederiv: 1.7420765 0.0000787 0.0001383 0.0000191 1.742059 0.0000084 -0.0000257 -0.0000042 1.7420352 -1.5298052 0.0235649 0.0676662 0.0236089 -1.0093685 -0.0029542 0.0677398 -0.0029696 -1.0170261 -1.1006379 0.1033623 -0.1727217 0.103442 -1.1242276 0.1936574 -0.1727701 0.1935132 -1.3317575 -1.0808422 -0.1818866 0.0136588 -0.1819671 -1.4648065 0.0342644 0.0137429 0.0344063 -1.0108722 -1.0307912 0.0548808 0.0912583 0.0548971 -1.1436564 -0.224976 0.091313 -0.2249457 -1.3823794 unknown
polarizability: 36.3677432|-0.0000115|36.3703568|-0.000481|0.0006213|36.3711214 unknown
InChI: InChI=1S/O4P/c1-5(2,3)4
charge -3 multiplicity 1
5 atoms
P  -0.000035 -0.000003 0.000012
O  1.691347 -0.076447 -0.219537
O  -0.711233 0.797216 -1.331609
O  -0.630469 -1.582051 0.119144
O  -0.349609 0.861286 1.43199
