program: Gaussian 09
title: 000167728
version: EM64L-G09RevD.01
frameworkgroup: C1[X(C19H30O3)]
method: RPBEPBE
basis: SDD
operation: Freq
keyword: #pfreq=noraman
keyword: PBEPBE/SDD
title: #p freq=noraman PBEPBE/SDD
converged: YES YES NO NO
title: Mulliken charges:
elementType: O O O C C C C C C C C C C C C C C C C C C C H H H H H H H H H H H H H H H H H H H H H H H H H H H H H H
charge: -0.466784 -0.443392 -0.201125 -0.199821 -0.164693 -0.141558 0.386732 0.385708 -0.019949 -0.524773 -0.517733 -0.149865 -0.555246 -0.194600 -0.573745 -0.461077 -0.494146 -0.801342 -0.849832 -0.589498 -0.530651 0.149511 0.256553 0.240415 0.253982 0.225081 0.215873 0.220495 0.201403 0.192556 0.215243 0.221538 0.220890 0.204208 0.213763 0.206312 0.235172 0.216011 0.222788 0.219701 0.223832 0.215121 0.233141 0.224523 0.243664 0.217052 0.247756 0.238226 0.218233 0.246309 0.338203 0.329831
chargesum: 0.00000
title: Mulliken charges with hydrogens summed into heavy atoms:
elementType: O O O C C C C C C C C C C C C C C C C C C C
charge: -0.128581 -0.113561 -0.201125 0.056732 0.075722 0.112425 0.386732 0.385708 0.205132 -0.088405 -0.123773 0.065378 -0.112818 0.009608 -0.153669 -0.009893 -0.051657 -0.129248 -0.164593 -0.103516 -0.066109 0.149511
polarizability: 2.43247774e+02 -1.19751263e+00 1.92557160e+02 2.36502502e+00 3.22469556e+00 1.64136061e+02
1716.lowfreq: -10.1505 -1.8488 -0.0010 0.0002 0.0003 12.0314 32.7071 65.2060 72.8931
frequency: 32.3143 65.1295 72.6749 90.0492 106.2007 108.3914 128.7693 158.0202 182.3076 194.8261 209.3669 224.2823 231.4609 233.2203 263.9472 270.0182 275.8404 291.9718 302.4920 319.6638 328.2356 339.6619 362.9738 380.6771 391.5041 418.1159 424.9555 453.0974 469.2674 485.3084 492.8153 517.8450 534.5273 547.7312 565.1762 603.1310 617.8443 640.0968 713.9553 721.1854 730.8328 770.6344 807.3725 822.6578 831.5654 835.9420 846.1963 871.6922 887.2605 905.0698 917.5455 925.9276 942.3613 955.4647 972.8556 985.4612 996.7739 1006.7734 1009.9816 1015.0995 1018.4006 1028.6903 1038.3019 1063.9952 1076.7883 1085.6381 1094.4761 1102.8733 1111.2921 1121.7079 1132.8332 1140.1154 1152.0739 1154.7206 1165.1982 1182.4603 1192.9535 1195.3772 1207.8063 1211.5371 1225.6769 1232.7543 1237.3998 1244.4433 1249.2006 1252.1324 1260.5356 1273.1214 1284.1270 1287.4174 1293.3838 1298.9177 1304.1264 1321.3521 1322.9461 1328.7710 1331.2954 1340.1100 1342.6901 1349.9172 1359.1729 1361.3013 1369.7673 1382.5352 1386.2315 1395.4255 1400.0800 1428.0048 1446.1112 1457.2702 1458.9323 1466.2447 1471.7249 1473.5311 1477.2953 1487.2015 1488.0903 1491.9542 1495.6500 1631.7823 2924.8773 2941.9824 2945.2076 2945.3952 2953.3283 2960.0028 2962.6348 2969.6862 2973.3430 2975.5039 2980.6534 2984.6543 2988.0041 2988.2016 2994.9565 3004.0762 3010.7590 3019.7832 3036.2840 3038.1617 3043.5136 3051.8995 3069.2901 3074.1208 3077.5753 3080.1163 3083.3016 3092.2072 3555.7963 3567.0887
redmass: 4.8522 4.6793 3.3137 3.2789 3.8468 1.9678 2.7947 2.9321 1.7190 2.2915 3.8169 3.3220 1.5034 1.9117 2.5688 1.1992 2.3922 1.2672 2.7244 2.1539 2.5881 2.8703 2.1755 2.7504 2.4791 3.4022 3.7171 2.7910 2.9725 3.8639 3.1830 2.6596 3.5340 3.0939 3.9286 2.8013 2.8134 3.0512 2.4083 3.4566 2.8791 2.5640 2.6356 2.0385 1.8044 1.7596 1.8343 2.2098 2.5570 1.8626 2.0770 2.3075 1.7934 2.0515 2.1117 2.4483 1.8641 2.2814 2.3955 2.1990 2.5737 1.9832 2.0442 1.9809 2.7863 1.9765 1.9186 1.6518 2.4327 1.8869 2.0478 1.3819 1.8223 1.8703 1.5443 1.5264 1.8144 2.0648 1.7049 1.3834 1.5537 1.3503 1.4134 1.3843 1.4505 1.4792 1.5128 1.4685 1.4037 1.3109 1.5327 1.4362 1.4056 1.4337 1.5868 1.3557 1.4454 1.4325 1.4488 1.4942 1.4534 1.3991 1.4106 1.3178 1.5859 1.2190 1.2163 1.0788 1.0837 1.0856 1.0730 1.0816 1.0828 1.0784 1.0751 1.0664 1.0683 1.0577 1.0602 9.9069 1.0843 1.0784 1.0668 1.0710 1.0772 1.0817 1.0726 1.0643 1.0652 1.0807 1.0583 1.0474 1.0632 1.0600 1.0391 1.0932 1.0985 1.0619 1.0996 1.0972 1.1007 1.1000 1.0977 1.0977 1.0969 1.1003 1.1011 1.0980 1.0660 1.0662
irintensity: 2.8861 2.9589 1.0818 3.6251 0.6728 0.5949 1.2092 2.3423 1.8142 1.0729 2.7204 2.1369 2.3891 5.6019 10.8149 111.3027 6.7965 169.3481 2.6879 2.2444 3.5378 1.9270 2.1451 2.4142 2.1590 6.0397 2.3109 3.8884 1.4371 8.5048 10.8471 0.8078 1.9767 6.4274 0.8752 2.2471 2.8908 4.4736 3.4448 6.8930 7.8836 1.3584 10.2327 0.2612 10.4574 0.5865 1.5212 2.5700 9.1323 1.2004 8.8179 5.4266 2.3462 7.6772 13.1657 27.0778 6.1963 11.6186 66.3803 26.7569 12.2712 7.7339 4.8768 11.0491 1.3413 15.1576 3.4136 18.3636 13.9055 4.2385 7.9415 4.4101 7.7697 7.4939 12.4060 29.7325 14.8178 13.6152 18.7066 4.0188 12.4702 31.5549 5.9323 3.2941 8.1431 5.4373 2.5015 3.3086 6.6864 4.8741 4.8686 1.5663 16.2770 2.8139 7.8610 0.3473 2.6707 5.0088 1.3095 2.5298 0.3029 0.5698 0.3354 6.9163 3.7020 13.6297 31.7815 13.9516 15.0185 19.2497 3.1145 8.1769 3.3237 12.6656 2.6433 6.3144 4.0036 6.9395 8.3984 196.2256 37.9323 21.5179 24.9304 33.6349 19.1801 11.0593 45.4094 4.6025 39.7022 29.1407 8.3779 24.4887 36.5092 40.4044 20.1926 61.7759 40.4559 38.6256 14.7603 59.5241 27.3828 14.3300 37.7986 12.1081 43.7019 47.7294 36.0066 31.2060 4.3970 3.3132
temp: 298.150 k
press: 1.00000 atm
elementType: 8 8 8 6 6 6 6 6 6 6 6 6 6 6 6 6 6 6 6 6 6 6 1 1 1 1 1 1 1 1 1 1 1 1 1 1 1 1 1 1 1 1 1 1 1 1 1 1 1 1 1 1
symmnumber: 1
zpe: 1197969.1 jmol-1
zpe.correction: 0.456282 hartree
zpe.thermalcorrener: 0.477656 hartree
zpe.thermalcorrenthalpy: 0.478600 hartree
zpe.thermalcorrgfe: 0.408401 hartree
zpe.sumelectzpe: -965.950350 hartree
zpe.sumelectthermal: -965.928977 hartree
zpe.sumelectthermalent: -965.928033 hartree
zpe.sumelectthermalfe: -965.998232 hartree
dipole: -1.0781 1.4291 -1.4451
dipole: 2.3006
quadrupole: -180.5662 -121.3951 -132.8704
quadrupole: 9.1150 -4.4476 3.1341
quadrupole: -35.6223 23.5488 12.0735 9.1150 -4.4476 3.1341
hfenergy: -966.4066326 hartree
pointgroup: C01 [X(C19H30O3)]
dipole: -0.4230752 -0.5514392 0.5798142 debye
polarizability: 243.2347998|1.0925107|192.6596343|-2.6367981|2.7174246|164.0465611 unknown
InChI: InChI=1S/C19H30O3/c1-18-7-5-12(20)9-11(18)10-15(21)17-13-3-4-16(22)19(13,2)8-6-14(17)18/h11,13-17,21-22H,3-10H2,1-2H3
charge 0 multiplicity 1
52 atoms
O  -0.067505 -2.325574 1.363413
O  -5.307258 1.235513 0.134108
O  5.699757 0.57372 -0.538246
C  -0.623788 -0.671813 -0.336201
C  0.194904 0.480341 0.334829
C  -2.072168 -0.637996 0.189381
C  -2.792765 0.717489 -0.077948
C  1.700489 0.515259 -0.133058
C  2.325714 -0.904434 0.113315
C  -0.521511 1.855023 0.197828
C  -2.005262 1.827615 0.657207
C  0.039996 -2.042459 -0.091018
C  -3.087561 -1.710283 -0.290552
C  -4.188554 0.367298 0.530845
C  1.513212 -2.045903 -0.538556
C  -4.483851 -1.07397 0.030359
C  2.485535 1.554579 0.749844
C  -2.950387 1.052464 -1.582607
C  1.83194 0.92205 -1.629105
C  3.803788 -0.961318 -0.347028
C  3.961493 1.160221 1.086837
C  4.599918 0.295204 0.01073
H  -0.636324 -0.526063 -1.436974
H  0.21936 0.231484 1.41946
H  -1.997121 -0.747345 1.292985
H  2.288863 -1.071125 1.21143
H  -0.483205 2.201203 -0.852335
H  0.023831 2.61333 0.791839
H  -2.047655 1.637393 1.751105
H  -2.458016 2.826034 0.481499
H  -0.519737 -2.823325 -0.650398
H  -2.938174 -2.671368 0.231436
H  -2.981065 -1.905305 -1.375242
H  -4.087992 0.378051 1.640758
H  1.548819 -1.956768 -1.643374
H  1.981022 -3.022791 -0.292404
H  -5.122838 -1.003312 -0.86771
H  -5.045623 -1.651043 0.784659
H  1.949501 1.702542 1.706846
H  2.48922 2.533591 0.236088
H  -3.557464 1.967273 -1.704883
H  -1.97712 1.219499 -2.074796
H  -3.47148 0.247919 -2.129632
H  1.388028 1.91738 -1.808357
H  2.889944 0.989402 -1.941265
H  1.331347 0.208419 -2.308385
H  3.891806 -1.122715 -1.43809
H  4.315932 -1.825442 0.126279
H  3.964999 0.559492 2.020301
H  4.587135 2.051696 1.261942
H  0.305789 -3.22667 1.533492
H  -5.175316 2.131133 0.536648
