program: Gaussian 09
title: 000167682
version: EM64L-G09RevD.01
frameworkgroup: C1[X(C9H12N2OS)]
method: RPBEPBE
basis: SDD
operation: Freq
keyword: #p
keyword: freq=noraman
keyword: PBEPBE/SDD
title: #p freq=noraman PBEPBE/SDD
converged: YES YES NO NO
title: Mulliken charges:
elementType: S O N N C C C C C C C C C H H H H H H H H H H H H
charge: 0.205008 -0.242194 -0.302002 -0.088764 0.358377 -0.332846 -0.151301 -0.441858 -0.740235 0.154494 -0.781080 -0.043714 -0.567208 0.316573 0.272805 0.224316 0.230467 0.251399 0.251850 0.241653 0.255804 0.241679 0.243133 0.224736 0.218907
chargesum: 0.00000
title: Mulliken charges with hydrogens summed into heavy atoms:
elementType: S O N N C C C C C C C C C
charge: 0.205008 -0.242194 0.014571 -0.088764 0.358377 -0.332846 -0.151301 0.055264 -0.006520 0.154494 -0.041943 0.199419 -0.123564
polarizability: 2.37902095e+02 5.02220586e+00 1.24256735e+02 8.29622638e+00 -1.88337591e-02 7.48696138e+01
1716.lowfreq: -5.2417 0.0014 0.0015 0.0026 2.1201 6.2681 20.8183 53.0223 60.3081
frequency: 20.6863 53.0154 60.3039 74.4166 76.5267 101.6482 109.2491 144.4532 188.3994 199.8694 263.9499 275.5523 315.2050 339.0238 386.9687 418.1578 454.4672 505.1132 513.8700 543.2712 576.8203 603.4983 635.7271 657.3662 664.9625 716.0210 898.7157 919.5966 945.4416 959.0425 976.2753 997.4992 1010.5606 1019.8518 1034.3462 1041.4570 1048.8639 1141.0997 1168.8802 1245.3233 1282.2409 1290.6158 1332.2405 1340.2476 1367.6332 1398.2164 1427.4154 1439.1897 1447.5399 1454.1604 1457.5260 1465.3510 1469.5320 1498.2186 1546.4562 1575.4630 1657.1003 2979.3589 2992.6332 3001.1555 3063.9536 3066.1388 3080.7011 3089.5879 3111.0798 3121.6528 3121.8147 3201.4206 3569.9926
redmass: 3.8061 3.9426 1.7499 2.7461 1.0439 1.7519 3.2782 4.0232 3.4219 4.2025 5.2843 4.9866 3.3359 2.6618 6.1739 3.8381 2.2079 1.7531 4.9187 2.2788 3.7902 4.9609 3.2115 4.4159 2.3561 4.3363 1.5461 2.9384 3.1230 1.3557 2.1148 2.1249 1.3737 1.6832 2.4771 1.5500 2.6087 1.9734 3.1761 1.2445 1.2376 5.2194 1.2661 5.2831 1.2431 1.2216 1.1925 1.1555 1.0450 1.1404 1.0481 1.5552 1.1216 4.7484 5.9948 7.9609 4.5857 1.0372 1.0628 1.0363 1.0972 1.0989 1.0957 1.0604 1.0951 1.0995 1.1015 1.1142 1.0777
irintensity: 0.2633 1.1875 1.2696 0.0880 0.8310 2.9388 0.3355 0.7883 0.5413 6.8411 3.8798 1.6742 2.7048 1.1535 0.7015 10.5998 17.6672 86.0448 23.0380 18.1153 40.8197 1.3689 1.5694 4.9698 15.7326 2.5337 8.1645 12.1875 57.7417 76.0094 14.4262 1.4769 16.2684 2.2421 72.3079 10.7752 14.6911 8.7552 39.5916 101.8780 1.8043 96.1508 29.7109 167.5195 46.5755 63.3240 35.3841 95.7116 13.5872 18.7353 21.4517 41.0229 20.2388 418.0155 527.6104 261.1279 22.9824 3.5820 50.3598 7.7882 13.6316 4.2981 7.2328 11.1797 8.9696 11.1791 21.8336 22.6009 84.7311
temp: 298.150 k
press: 1.00000 atm
elementType: 16 8 7 7 6 6 6 6 6 6 6 6 6 1 1 1 1 1 1 1 1 1 1 1 1
symmnumber: 1
zpe: 509334.8 jmol-1
zpe.correction: 0.193995 hartree
zpe.thermalcorrener: 0.208813 hartree
zpe.thermalcorrenthalpy: 0.209758 hartree
zpe.thermalcorrgfe: 0.150151 hartree
zpe.sumelectzpe: -931.946268 hartree
zpe.sumelectthermal: -931.931450 hartree
zpe.sumelectthermalent: -931.930506 hartree
zpe.sumelectthermalfe: -931.990112 hartree
dipole: -4.9958 -2.6391 -0.3819
dipole: 5.6630
quadrupole: -85.5920 -82.7309 -83.9413
quadrupole: -3.1050 0.3808 0.1174
quadrupole: -1.5039 1.3572 0.1467 -3.1050 0.3808 0.1174
hfenergy: -932.1402632 hartree
pointgroup: C01 [X(C9H12N2O1S1)]
dipole: 1.9858855 -0.9516717 0.3383437 debye
dipolederiv: -0.3666541 -0.0102525 -0.0400845 -0.3287839 -0.4781635 0.0362571 -0.0168252 0.0644024 0.040363 -1.2728495 0.0622099 -0.1218575 0.4975967 -0.6044162 0.0953096 -0.1890851 0.0446126 -0.3424139 -2.0903256 0.0633707 -0.12437 0.2499115 -0.2626917 0.0170251 -0.0953933 -0.0259859 -0.4714441 -1.3984558 0.1132947 -0.1381416 0.8992419 -0.8299085 0.1615232 -0.2449204 0.0870879 -0.2746547 1.1290895 -0.1076348 0.1354439 0.2616809 0.5541219 -0.0171862 0.0964635 -0.0738777 0.1083684 -1.1398767 -0.4707855 -0.0375116 -0.9632081 -0.1786695 -0.1237699 -0.0046575 -0.0682778 -0.2007844 2.1678964 0.0334864 0.2140581 -0.8405377 0.8199339 -0.175935 0.4032992 -0.0841999 0.1273041 0.6430207 0.1552109 0.0460441 0.6842969 0.2184104 0.0319052 -0.0780951 0.0283279 0.2713092 0.0395388 0.2076776 -0.0213018 0.1328456 -0.1360617 0.0364064 -0.0153979 0.0483838 0.01145 2.0364417 0.2755706 0.1917653 0.2137427 0.8926276 -0.0658386 0.2236819 -0.0538857 0.1879405 -0.0754468 -0.1214481 0.0005588 -0.2742583 -0.455946 0.0290749 0.0172368 0.0456364 0.0465781 0.1657332 -0.1016421 -0.012076 -0.2716777 -0.2016619 0.002213 -0.1196588 0.0418795 0.120384 -0.2542675 -0.0516254 0.0139352 -0.0122803 -0.369796 0.0716477 0.0567687 0.0700692 0.1005757 0.1706932 -0.0559358 -0.014789 -0.1667035 0.1321467 0.0052391 -0.0316258 0.0030435 0.3344016 0.1164434 0.084928 0.0091695 -0.0374583 0.0251022 0.0164331 0.0593006 0.0322195 0.0951576 -0.1176758 -0.0472135 -0.1006647 -0.1172963 0.0874719 0.0067134 -0.0730519 -0.0347749 -0.1163738 0.0057683 -0.1625573 0.0037527 -0.061944 -0.0302189 0.0098996 -0.0075948 -0.0037688 0.1148788 0.066935 0.0032638 -0.0782739 -0.0322216 0.0591969 -0.0269935 -0.0573541 0.0178958 -0.030711 0.0245506 0.032 0.0903847 -0.0191265 0.0570235 0.0032201 0.0789852 -0.0298862 0.0156886 0.0555924 0.0603478 0.1001163 0.0157172 0.032027 -0.058863 0.0744147 -0.0715208 0.0095067 -0.1250426 -0.0552273 -0.0244083 0.0339198 0.1031769 0.0066702 -0.0369802 -0.0047766 0.1176434 0.0958523 0.0187603 -0.0839824 -0.0135267 0.0620746 0.0409077 -0.048054 0.0637448 -0.0608902 0.0656593 0.0179847 -0.0643649 0.0667791 0.1442985 -0.0291171 -0.0122949 -0.0291999 -0.0947752 -0.035952 0.0397913 0.0829185 0.0815092 0.1782802 -0.0370346 0.0928128 -0.0413654 -0.0069851 0.0933316 0.0164259 -0.026321 0.0017815 0.1816417 -0.0357074 -0.0719746 -0.0257838 -0.1025172 unknown
polarizability: 237.3106405|-0.2920067|123.3908059|14.1091929|-5.6987619|76.3269972 unknown
InChI: InChI=1S/C9H12N2OS/c1-4-5-10-9-11-6(2)8(13-9)7(3)12/h4,10H,1,5H2,2-3H3
charge 0 multiplicity 1
25 atoms
S  -0.56413 -1.60429 0.344534
O  -3.991778 0.487245 -0.381756
N  2.055605 -0.653977 0.579104
N  0.314854 0.929299 0.143464
C  -1.063254 0.991164 -0.049142
C  -1.753279 -0.234643 0.012707
C  0.748036 -0.317398 0.359377
C  3.149209 0.345626 0.588346
C  -1.69797 2.331148 -0.303966
C  -3.18683 -0.476745 -0.151843
C  -3.695222 -1.91342 -0.041455
C  4.217664 0.002511 -0.429927
C  5.524519 -0.193485 -0.124614
H  2.304108 -1.634551 0.711806
H  2.675922 1.316521 0.358588
H  3.589634 0.410298 1.60213
H  -0.920485 3.110924 -0.294826
H  -2.230728 2.337931 -1.270759
H  -2.467787 2.553844 0.455117
H  -3.223535 -2.559517 -0.806087
H  -4.786541 -1.921319 -0.184571
H  -3.454727 -2.343721 0.949176
H  3.873295 -0.075595 -1.471086
H  6.267249 -0.419426 -0.89723
H  5.891174 -0.120825 0.907413
