program: Gaussian 09
title: 000167778
version: EM64L-G09RevD.01
frameworkgroup: C1[X(C22H18O9Si)]
method: RPBEPBE
basis: SDD
operation: Freq
keyword: #p
keyword: freq=noraman
keyword: PBEPBE/SDD
title: #p freq=noraman PBEPBE/SDD
converged: YES YES NO NO
title: Mulliken charges:
elementType: Si O O O O O O O O O C C C C C C C C C C C C C C C C C C C C C C H H H H H H H H H H H H H H H H H H
charge: 1.421984 -0.373295 -0.423410 -0.420722 -0.460193 -0.418490 -0.419919 -0.217851 -0.330942 -0.329976 -0.309389 -0.309197 -0.317621 -1.018114 0.083340 0.108120 0.120043 -0.268683 -0.246829 -0.250046 0.128881 0.098289 0.096875 -0.269502 -0.253463 -0.256986 -0.302460 -0.328290 -0.330232 0.090565 0.155020 0.155849 0.280944 0.277507 0.218165 0.243936 0.259926 0.246514 0.233752 0.240408 0.237407 0.286493 0.274592 0.273414 0.372826 0.391754 0.393698 0.379200 0.393254 0.392854
chargesum: 0.00000
title: Mulliken charges with hydrogens summed into heavy atoms:
elementType: Si O O O O O O O O O C C C C C C C C C C C C C C C C C C C C C C
charge: 1.421984 -0.000469 -0.031656 -0.027024 -0.080994 -0.025236 -0.027064 -0.217851 -0.330942 -0.329976 -0.309389 -0.309197 -0.317621 -0.241498 0.083340 0.108120 0.120043 -0.024747 0.013097 -0.003532 0.128881 0.098289 0.096875 -0.035750 -0.013055 -0.019579 -0.015967 -0.053698 -0.056818 0.090565 0.155020 0.155849
polarizability: 3.54354812e+02 2.65244606e+00 3.45931134e+02 -6.85159905e-01 2.12510974e-01 2.25615926e+02
1716.lowfreq: -7.4620 -5.6151 -3.6893 -0.0006 0.0008 0.0011 8.5984 18.8148 21.9861
frequency: 8.3012 18.7417 21.9722 25.0707 30.7561 31.4692 35.3974 76.2504 79.4497 82.4527 108.6015 116.8904 123.1209 138.0277 140.6301 143.9712 166.3555 185.4294 186.3267 196.1968 212.9960 233.4883 251.1567 256.0963 260.9277 271.7336 273.8316 335.2381 351.6231 362.6558 366.2847 384.5872 403.8808 410.6186 422.6222 437.5405 439.6660 471.5823 473.8281 489.2252 531.1959 535.6346 536.5509 540.3792 543.0106 544.5086 574.9235 584.6041 587.7378 589.1870 591.3481 594.2094 614.7583 629.0811 635.4984 690.0392 699.3491 703.5943 712.1598 761.3341 763.1484 768.9904 770.1207 791.3689 794.2786 808.3310 811.6123 816.2294 820.8389 831.4730 832.3186 846.2773 853.6984 859.9287 869.8277 953.5272 955.0426 958.3681 989.9925 991.6738 993.9854 994.6900 1043.0853 1044.3774 1070.4065 1071.8135 1080.0457 1121.2060 1140.9406 1143.1422 1152.7087 1172.0412 1178.4854 1178.8368 1205.1282 1206.4367 1233.6607 1246.0020 1249.4464 1279.7429 1298.0234 1298.6728 1314.6914 1316.1506 1361.9020 1372.3016 1374.8060 1403.0496 1404.2043 1423.0418 1425.8062 1427.7807 1432.2846 1445.3715 1446.2370 1452.5552 1462.6438 1565.1050 1567.2772 1578.6140 1579.0383 1580.2944 1593.9437 1626.2088 1627.8769 1653.1332 2979.4621 2999.8093 3010.0199 3078.9231 3120.0770 3122.9066 3129.3416 3130.5220 3154.3735 3154.7030 3155.4014 3176.2757 3177.0325 3187.9563 3521.3151 3529.8433 3530.8547 3532.9374
redmass: 7.9934 7.5800 8.8854 6.4150 6.7029 6.5640 6.7766 6.3384 6.8125 7.0890 6.1031 6.5455 3.4495 2.9688 3.4874 5.9216 4.0505 4.3411 3.5530 3.9097 2.8025 5.9769 5.9402 5.4874 5.6300 5.3188 5.2086 5.6788 6.5134 7.7752 7.3223 7.6641 4.4837 1.9084 3.3655 9.8415 9.8256 4.0896 4.3196 2.8588 4.4015 3.9756 3.6115 3.3864 4.0617 4.9312 6.9155 4.3198 2.0130 1.3869 2.3220 1.2867 5.1824 5.1433 5.0706 6.0345 6.3808 6.6300 7.0562 2.3250 2.4721 2.4434 3.6317 4.8909 3.1981 1.9895 1.9080 2.2552 6.0402 6.0445 5.4019 1.1269 1.6010 1.1057 1.5857 1.3677 1.3660 1.3591 1.3625 4.5231 1.3723 1.3672 3.6134 3.6912 2.4626 2.4210 2.5131 2.2684 1.9693 1.9611 1.5698 1.3394 1.4828 1.4730 1.5293 1.5306 1.9912 3.0411 2.9752 1.8338 1.1935 2.3309 1.8551 1.9078 5.4944 4.6022 4.4058 2.9327 2.8065 3.0421 2.2002 3.4166 1.2985 2.4239 2.4767 2.5659 1.0612 4.2437 4.3823 6.5251 5.9583 6.3371 6.5809 4.4430 4.5817 8.7300 1.0389 1.0687 1.0685 1.0917 1.1002 1.0887 1.0893 1.0889 1.0929 1.0907 1.0904 1.0984 1.0983 1.0955 1.0654 1.0642 1.0642 1.0642
irintensity: 0.5081 0.2077 0.4484 0.2084 0.5626 0.2714 0.5519 0.9914 0.3398 0.3836 0.1978 1.1869 0.7471 1.8826 1.0244 1.1380 2.4962 0.5868 0.9039 0.1270 2.1487 2.6008 2.5338 0.3982 3.4138 3.4944 1.3924 20.1195 17.3385 24.5488 13.8851 24.3329 17.5919 73.8606 53.9572 4.3443 11.0690 1.9137 7.9323 24.3497 13.2230 2.3564 2.6255 1.2303 8.9152 2.0997 12.8431 27.2249 19.8475 187.8139 168.3758 153.5992 7.3660 31.6625 42.1817 39.0683 5.7247 11.9295 1.0780 41.0960 51.8937 28.8216 24.7462 20.1880 1.3499 23.0307 24.9748 10.8419 40.8283 12.7044 17.8652 87.3317 87.6749 123.4284 111.3105 2.1352 2.1724 2.9114 0.3631 456.7484 6.2778 2.2216 673.1039 217.1787 11.4000 15.5385 7.0033 72.8260 33.9557 65.8610 122.1027 8.5112 34.2703 45.1731 35.9201 20.6559 14.3775 29.5458 31.6795 10.7146 27.5428 78.1754 167.8183 185.6610 66.7477 67.8709 84.8438 127.1915 88.8205 52.3607 158.0535 77.3844 36.3341 61.6630 46.0178 15.3976 7.8283 12.3325 12.0567 124.0573 14.5933 111.2539 128.6396 261.4676 230.3939 296.6386 14.8094 395.1335 346.1612 12.4111 3.1953 4.6968 1.1852 3.2413 13.7966 8.2769 6.6204 9.3979 8.2633 3.9375 90.9749 87.2003 79.0947 39.8066
temp: 298.150 k
press: 1.00000 atm
elementType: 14 8 8 8 8 8 8 8 8 8 6 6 6 6 6 6 6 6 6 6 6 6 6 6 6 6 6 6 6 6 6 6 1 1 1 1 1 1 1 1 1 1 1 1 1 1 1 1 1 1
symmnumber: 1
zpe: 938112.1 jmol-1
zpe.correction: 0.357308 hartree
zpe.thermalcorrener: 0.387542 hartree
zpe.thermalcorrenthalpy: 0.388486 hartree
zpe.thermalcorrgfe: 0.291939 hartree
zpe.sumelectzpe: -1813.356068 hartree
zpe.sumelectthermal: -1813.325834 hartree
zpe.sumelectthermalent: -1813.324890 hartree
zpe.sumelectthermalfe: -1813.421437 hartree
dipole: 3.8306 2.9002 -3.6586
dipole: 6.0391
quadrupole: -172.8288 -173.7461 -190.7956
quadrupole: -14.9327 4.1255 4.5951
quadrupole: 6.2947 5.3774 -11.6722 -14.9327 4.1255 4.5951
hfenergy: -1813.7133757 hartree
pointgroup: C01 [X(C22H18O9Si1)]
dipole: -0.2370848 -1.9670968 -1.3112831 debye
polarizability: 347.448665|4.4436341|352.1997778|2.932326|-8.3894971|226.2534297 unknown
InChI: InChI=1S/C22H18O9Si/c1-32(14-8-2-5-11(17(14)23)20(26)27,15-9-3-6-12(18(15)24)21(28)29)16-10-4-7-13(19(16)25)22(30)31/h2-10,23-26,28,30H,1H3
charge 0 multiplicity 1
50 atoms
Si -0.056361 -0.028098 0.536626
O  -0.482669 3.092997 1.245525
O  -2.231497 -2.059921 1.266216
O  2.777011 -0.788057 1.348999
O  1.351313 6.366536 -0.786799
O  -6.204782 -2.404516 -0.177914
O  5.127505 -4.121745 0.178616
O  -0.136489 5.788919 0.891129
O  -4.550539 -3.200608 1.230793
O  4.953833 -2.183275 1.430294
C  0.705959 1.550071 -0.259485
C  -1.833803 -0.182949 -0.175437
C  0.970432 -1.535303 -0.038007
C  -0.129332 0.091567 2.447418
C  0.392307 2.872922 0.18244
C  -2.717962 -1.191468 0.306125
C  2.288868 -1.729324 0.463703
C  1.602014 1.411417 -1.348132
C  -2.330179 0.702965 -1.160051
C  0.466499 -2.492679 -0.946088
C  0.952323 4.024305 -0.458236
C  -4.062901 -1.299301 -0.19313
C  3.075221 -2.862957 0.056556
C  2.169625 2.533364 -1.994338
C  -3.655939 0.612344 -1.665309
C  1.229497 -3.61751 -1.362475
C  1.842435 3.824918 -1.549287
C  -4.516842 -0.383184 -1.182752
C  2.525958 -3.8010 -0.861248
C  0.636106 5.407964 -0.016986
C  -4.920329 -2.357043 0.343053
C  4.423126 -3.006051 0.607718
H  -0.216144 -0.933784 2.845203
H  0.792673 0.548488 2.8433
H  -1.015229 0.641063 2.822705
H  1.861246 0.404785 -1.697473
H  -1.668567 1.487563 -1.546208
H  -0.548063 -2.364253 -1.341181
H  2.860078 2.396417 -2.832327
H  -4.000393 1.32225 -2.423253
H  0.80211 -4.337401 -2.067019
H  2.267609 4.709085 -2.030041
H  -5.543023 -0.475157 -1.55057
H  3.135238 -4.658768 -1.161058
H  -0.732949 2.238975 1.684579
H  -2.969382 -2.722751 1.513563
H  3.727429 -1.04936 1.617566
H  1.100326 7.265766 -0.444484
H  -6.704806 -3.149213 0.252318
H  6.024241 -4.126306 0.609345
