program: Gaussian 09
title: 000167696
version: EM64L-G09RevD.01
frameworkgroup: C1[X(C6H19NO4Si2)]
method: RPBEPBE
basis: SDD
operation: Freq
keyword: #p
keyword: freq=noraman
keyword: PBEPBE/SDD
title: #p freq=noraman PBEPBE/SDD
converged: YES YES NO NO
title: Mulliken charges:
elementType: Si Si O O O O N C C C C C C H H H H H H H H H H H H H H H H H H H
charge: 1.606129 0.917642 -0.616384 -0.579635 -0.274623 -0.265600 -1.248997 -0.372043 -1.058025 -0.476110 -0.475168 -0.505167 -0.521806 -0.075956 -0.072360 0.364296 0.234228 0.245991 0.255061 0.252516 0.214437 0.210398 0.231928 0.215313 0.208861 0.225568 0.230636 0.232369 0.207873 0.236955 0.228940 0.222735
chargesum: 0.00000
title: Mulliken charges with hydrogens summed into heavy atoms:
elementType: Si Si O O O O N C C C C C C
charge: 1.606129 0.769326 -0.616384 -0.579635 -0.274623 -0.265600 -0.884701 -0.137816 -0.304456 0.180654 0.174573 0.165710 0.166823
polarizability: 1.54855043e+02 -8.27729575e-01 1.26888622e+02 -2.61590694e+00 -1.02705268e+00 1.15525856e+02
1716.lowfreq: -12.1193 -2.6159 0.0017 0.0018 0.0019 4.9649 28.6151 32.3003 45.4084
frequency: 26.6024 31.0600 45.3604 48.6046 69.4771 77.4215 86.2311 100.9336 103.4471 105.9046 114.7286 134.1448 146.8611 148.6826 160.3056 175.9848 205.0478 220.3997 227.4522 236.2483 288.4109 319.7706 354.7125 380.2709 413.9070 498.2374 561.1975 573.3227 593.9923 672.2798 681.8562 708.9993 760.2004 770.6993 800.1138 834.6909 872.7288 874.0804 882.6593 929.0749 953.8764 980.2577 1036.8932 1045.0649 1066.0242 1105.2196 1112.5335 1121.0083 1122.2919 1133.9754 1144.2752 1148.0791 1148.6860 1230.5842 1259.5598 1319.6547 1323.7410 1418.5705 1425.6924 1438.3569 1439.3683 1443.6942 1450.8114 1454.8890 1456.3303 1470.4137 1471.7889 1473.0311 1474.1161 1475.1378 1480.5687 2124.1954 2133.9534 2945.6926 2947.0348 2952.2799 2956.2288 2963.3352 2999.7992 3028.7650 3033.0303 3049.8601 3052.3244 3082.5259 3085.6362 3102.8828 3109.3517 3112.5066 3116.5789 3522.2772
redmass: 3.8257 3.5306 3.9540 3.2004 2.6598 1.3530 2.8302 2.2554 1.1494 1.8948 1.5817 1.2761 1.8094 1.2583 2.9329 2.1409 3.5405 3.7473 3.8811 3.4361 4.2701 4.7101 5.7461 4.7099 3.6482 1.6137 5.5508 1.7008 2.5502 1.2229 3.6071 4.1211 4.5143 2.2313 1.4169 5.0032 1.9246 3.0683 1.5711 2.1183 1.5061 9.5709 7.8422 6.5012 5.6393 1.2625 1.2655 1.2591 1.2535 1.3170 1.4126 1.3921 1.4466 1.2181 1.3630 1.2047 1.1262 1.1249 1.1417 1.1210 1.0627 1.0957 1.0593 1.0523 1.0557 1.0517 1.0514 1.0521 1.0523 1.0518 1.0514 1.0325 1.0506 1.0320 1.0323 1.0364 1.0358 1.0804 1.0347 1.1034 1.1024 1.0978 1.0996 1.1009 1.0998 1.0977 1.0990 1.1016 1.1014 1.0744
irintensity: 0.4920 0.7814 1.0675 2.2145 1.4728 0.8625 0.1476 7.0767 0.9086 3.8647 2.3184 0.5551 1.7141 1.4278 7.0414 6.5166 0.8774 14.1804 23.9173 1.0196 19.1745 1.1640 26.8985 40.6860 13.5980 8.1298 10.8514 77.9129 41.3619 5.7920 73.5180 47.9078 106.4188 46.5515 175.0351 36.7325 46.5668 38.1355 79.2559 227.6873 144.4603 241.5748 61.0198 244.9720 197.6319 0.2962 0.3719 1.1652 0.1524 3.3950 25.0495 4.8789 43.5674 206.2631 5.5720 48.3694 0.9792 4.4730 3.7170 0.6423 4.6937 2.5453 9.0205 11.2994 3.9298 4.9006 18.4970 11.5957 5.6015 2.1031 8.0277 73.8863 116.7154 111.6537 68.0546 55.8536 55.4682 37.5963 6.6345 48.8608 65.3251 23.1543 73.4298 45.6537 31.0406 9.8071 10.9323 24.6319 23.7719 36.0261
temp: 298.150 k
press: 1.00000 atm
elementType: 14 14 8 8 8 8 7 6 6 6 6 6 6 1 1 1 1 1 1 1 1 1 1 1 1 1 1 1 1 1 1 1
symmnumber: 1
zpe: 664997.2 jmol-1
zpe.correction: 0.253284 hartree
zpe.thermalcorrener: 0.274031 hartree
zpe.thermalcorrenthalpy: 0.274975 hartree
zpe.thermalcorrgfe: 0.201597 hartree
zpe.sumelectzpe: -1173.388168 hartree
zpe.sumelectthermal: -1173.367421 hartree
zpe.sumelectthermalent: -1173.366476 hartree
zpe.sumelectthermalfe: -1173.439855 hartree
dipole: 0.2583 0.3466 -0.0643
dipole: 0.4370
quadrupole: -84.4073 -92.4666 -93.7351
quadrupole: 4.6535 3.1615 -4.8796
quadrupole: 5.7957 -2.2636 -3.5321 4.6535 3.1615 -4.8796
hfenergy: -1173.6414518 hartree
pointgroup: C01 [X(C6H19N1O4Si2)]
dipole: 0.1121524 0.1261142 -0.0327672 debye
polarizability: 154.2020499|-3.4082816|127.219207|-4.2120463|-0.9114396|115.8482634 unknown
InChI: InChI=1S/C6H19NO4Si2/c1-8-6(9-2)12-7-13(5,10-3)11-4/h6-7H,12H2,1-5H3
charge 0 multiplicity 1
32 atoms
Si -2.141783 0.295241 0.679672
Si 0.625042 -0.872725 -0.247697
O  -2.398551 -0.992247 -0.452923
O  -2.762771 1.796225 0.079444
O  3.338325 -1.024389 -0.573889
O  2.670103 0.93135 0.723248
N  -0.390907 0.228024 0.727651
C  2.415054 -0.48582 0.413051
C  -3.054344 0.067705 2.31314
C  -3.67767 -1.456566 -0.968649
C  -2.260835 2.499338 -1.097158
C  4.725482 -1.138232 -0.084668
C  2.535108 1.829491 -0.437313
H  0.349312 -2.32832 0.017796
H  0.543862 -0.60687 -1.727931
H  0.134421 0.85863 1.343448
H  2.57672 -0.966333 1.402097
H  -2.789342 -0.901646 2.769243
H  -2.787252 0.870114 3.022848
H  -4.147588 0.103292 2.164475
H  -4.250106 -0.633751 -1.441778
H  -4.297004 -1.909731 -0.168146
H  -3.460489 -2.226215 -1.727613
H  -2.640651 2.036713 -2.028926
H  -1.151916 2.502578 -1.128013
H  -2.625633 3.538355 -1.034684
H  5.123117 -0.149574 0.21054
H  5.308743 -1.54846 -0.923269
H  4.778764 -1.827706 0.782528
H  3.162294 1.484662 -1.27948
H  2.875668 2.816923 -0.088996
H  1.479326 1.897543 -0.770747
