program: Gaussian 09
title: 000167683
version: EM64L-G09RevD.01
frameworkgroup: C1[X(C15H18O3)]
method: RPBEPBE
basis: SDD
operation: Freq
keyword: #pfreq=noraman
keyword: PBEPBE/SDD
title: #p freq=noraman PBEPBE/SDD
converged: YES YES NO NO
title: Mulliken charges:
elementType: O O O C C C C C C C C C C C C C C C H H H H H H H H H H H H H H H H H H
charge: -0.245356 -0.191924 -0.232214 -0.063680 -0.103777 -0.424810 -0.255626 -0.461661 0.185156 -0.532842 0.251853 0.463621 0.174675 -0.722093 -0.026671 -0.498313 -0.844914 -0.821509 0.225805 0.267580 0.248179 0.262758 0.222495 0.215915 0.215531 0.221719 0.220608 0.215791 0.252633 0.273144 0.311717 0.231936 0.223849 0.225845 0.228775 0.285802
chargesum: 0.00000
title: Mulliken charges with hydrogens summed into heavy atoms:
elementType: O O O C C C C C C C C C C C C C C C
charge: -0.245356 -0.191924 -0.232214 0.162125 0.163803 -0.176631 0.007132 -0.023250 0.185156 -0.095592 0.251853 0.463621 0.174675 -0.033061 -0.026671 -0.225169 -0.077413 -0.081087
polarizability: 2.06014262e+02 7.91551499e+00 1.90512054e+02 1.23569092e+01 9.47343035e-01 1.08639091e+02
1716.lowfreq: -6.4132 0.0006 0.0006 0.0007 6.5836 13.2172 46.4850 58.4272 89.6453
frequency: 46.4439 58.4198 89.6433 117.1087 121.4430 142.3923 156.5553 168.8945 177.2809 183.5266 208.7054 230.0964 263.8618 274.9247 297.4441 321.4519 345.0862 361.8259 380.3812 427.5260 440.1502 472.0059 504.2946 530.2877 575.5368 581.7931 607.1676 629.6393 638.6130 672.8675 722.9967 758.2494 801.5723 829.6928 842.6494 868.0711 898.1924 915.7284 929.9167 939.7277 993.6471 998.3200 1014.9779 1029.1255 1041.0270 1046.2261 1051.9265 1070.6109 1085.2073 1102.5097 1121.6050 1141.2850 1151.5773 1159.3095 1164.6468 1199.4099 1203.5883 1229.2265 1240.4843 1249.7821 1259.6492 1275.3086 1289.8152 1308.7249 1309.5983 1327.1443 1339.6055 1354.7829 1365.7962 1388.4863 1393.4089 1400.2090 1446.2615 1449.4621 1459.4826 1463.1864 1470.4592 1473.3070 1475.8307 1486.2279 1588.2444 1629.2096 1663.5904 1706.4239 2946.0628 2957.0194 2957.5988 2961.9655 2963.0874 2977.7695 2978.1015 2989.8876 3000.4255 3025.0345 3037.7590 3043.7214 3058.6136 3085.5547 3096.8965 3099.0325 3116.0214 3185.6773
redmass: 5.0956 4.0656 3.2412 1.4002 5.5573 3.8074 3.6230 1.2200 1.0381 1.9630 2.5961 2.9184 3.9313 3.1415 4.1790 4.0826 4.0970 3.3823 3.4909 2.8379 4.1603 3.8271 3.3209 4.1697 4.6084 4.7686 2.9908 3.8853 4.1773 5.6938 3.6681 4.0054 3.6971 2.4660 2.1545 2.1430 1.8376 3.6998 2.9037 1.7313 1.7478 1.7711 2.3584 2.2631 1.7883 1.6740 2.5228 2.3532 2.3192 2.0341 2.8160 2.3672 1.9198 2.0200 1.4705 2.0366 1.5946 1.7017 2.8477 1.3357 1.4408 1.5267 1.3818 1.3915 2.8850 1.5351 1.3546 1.5183 1.5762 1.2007 1.2013 1.2474 1.1016 1.0480 1.0907 1.0839 1.0843 1.0473 1.0515 1.0510 8.2451 6.3267 7.7505 12.3325 1.0805 1.0728 1.0481 1.0824 1.0652 1.0437 1.0566 1.0360 1.0868 1.0949 1.1023 1.0951 1.0920 1.1003 1.0996 1.1006 1.0981 1.0976
irintensity: 5.3030 2.3885 1.0732 0.0750 0.3791 2.5839 0.8709 0.0997 0.1112 2.1395 1.5662 5.4768 0.2183 4.2295 0.7021 3.4191 2.0106 1.5550 0.7344 0.4337 1.5053 17.0918 0.2968 5.7547 0.8372 4.8887 2.4684 10.8543 15.6747 4.3431 4.2641 2.7749 23.5992 12.9948 9.5446 10.1575 26.6058 113.2363 52.1227 3.3518 34.2873 7.2844 60.2067 37.8608 29.0552 2.3491 5.4848 6.8651 42.3377 5.4968 21.1246 40.7457 4.3248 12.4386 6.8445 39.9400 13.1519 18.1544 7.4474 1.1259 20.5789 23.1732 7.6829 3.5504 35.3763 2.9137 11.1298 6.4625 0.1178 54.5763 19.2182 31.6161 50.0916 13.0838 6.4349 31.9009 8.7538 25.7227 7.4784 14.0042 224.2481 59.3734 131.2181 331.2929 0.4927 14.6832 20.0570 17.2464 22.1865 31.3346 12.0489 23.9896 31.3393 17.6757 42.1648 39.1823 13.7192 27.5969 14.3030 17.6843 5.6959 6.2744
temp: 298.150 k
press: 1.00000 atm
elementType: 8 8 8 6 6 6 6 6 6 6 6 6 6 6 6 6 6 6 1 1 1 1 1 1 1 1 1 1 1 1 1 1 1 1 1 1
symmnumber: 1
zpe: 775366.2 jmol-1
zpe.correction: 0.295321 hartree
zpe.thermalcorrener: 0.312366 hartree
zpe.thermalcorrenthalpy: 0.313310 hartree
zpe.thermalcorrgfe: 0.251441 hartree
zpe.sumelectzpe: -806.725334 hartree
zpe.sumelectthermal: -806.708290 hartree
zpe.sumelectthermalent: -806.707345 hartree
zpe.sumelectthermalfe: -806.769215 hartree
dipole: 1.4171 -4.0270 1.8387
dipole: 4.6482
quadrupole: -139.2189 -99.0607 -104.4768
quadrupole: -11.3013 -3.4378 2.2242
quadrupole: -24.9668 15.1914 9.7753 -11.3013 -3.4378 2.2242
hfenergy: -807.0206554 hartree
pointgroup: C01 [X(C15H18O3)]
dipole: 0.5725564 -1.5848348 0.7104459 debye
polarizability: 205.7204058|7.9618125|190.6665097|12.8472156|1.9256897|108.7784903 unknown
InChI: InChI=1S/C15H18O3/c1-7-4-5-10-9(3)15(17)18-14(10)13-8(2)6-11(16)12(7)13/h6,9-10,13-14H,4-5H2,1-3H3
charge 0 multiplicity 1
36 atoms
O  1.692764 1.36267 -0.201304
O  4.006176 1.460994 -0.410666
O  -4.008477 0.242421 -0.809914
C  1.428963 -0.978536 0.200589
C  0.650557 0.273973 -0.269446
C  -0.597341 0.613717 0.576391
C  2.822009 -0.756179 -0.441232
C  0.732862 -2.315503 -0.092947
C  -1.76304 -0.302964 0.156964
C  -0.583977 -2.489504 0.718474
C  -1.775641 -1.675063 0.209142
C  -1.153818 2.031965 0.366308
C  2.974617 0.774771 -0.364588
C  4.005672 -1.49558 0.204205
C  -2.879534 0.586732 -0.336623
C  -2.418648 1.981016 -0.155283
C  -2.966926 -2.505142 -0.224589
C  -0.396749 3.268988 0.754496
H  1.555576 -0.889445 1.302037
H  0.358344 0.187685 -1.334934
H  -0.329572 0.478923 1.646235
H  2.770346 -1.017528 -1.521012
H  1.421172 -3.138949 0.180173
H  0.524249 -2.415326 -1.176769
H  -0.376394 -2.229165 1.778326
H  -0.867358 -3.557756 0.709744
H  4.040311 -1.308747 1.292818
H  3.929841 -2.584988 0.040333
H  4.9580 -1.143648 -0.227932
H  -3.052004 2.837518 -0.396861
H  -3.794024 -1.885363 -0.598631
H  -3.325149 -3.119467 0.626098
H  -2.660111 -3.222054 -1.01311
H  -0.090931 3.221933 1.818238
H  -1.004855 4.176446 0.605044
H  0.539989 3.354457 0.176426
