program: Gaussian 09
title: 000013032
version: EM64L-G09RevD.01
frameworkgroup: C1[X(C9H13N)]
method: RPBEPBE
basis: SDD
operation: Freq
keyword: #pfreq=noraman
keyword: PBEPBE/SDD
title: #p freq=noraman PBEPBE/SDD
converged: YES YES NO NO
title: Mulliken charges:
elementType: N C C C C C C C C C H H H H H H H H H H H H H
charge: -0.433685 -0.038730 -0.723796 -0.674993 0.479682 -0.433125 -0.380050 -0.194191 -0.223309 -0.280183 0.208516 0.282061 0.222243 0.202968 0.235092 0.243813 0.207108 0.206703 0.210199 0.227674 0.217265 0.215771 0.222968
chargesum: 0.00000
title: Mulliken charges with hydrogens summed into heavy atoms:
elementType: N C C C C C C C C C
charge: -0.151625 0.169786 -0.063493 -0.017369 0.479682 -0.222926 -0.152377 0.023073 -0.007539 -0.057215
polarizability: 1.48800232e+02 -2.54418707e+00 1.01440305e+02 -1.40133619e+00 -8.23973768e+00 6.24374295e+01
1716.lowfreq: -0.0006 -0.0003 -0.0001 5.5395 13.9312 17.0859 60.4763 82.5374 145.7282
frequency: 60.3985 82.5080 145.7230 210.2733 211.8518 249.3568 294.2093 352.0124 377.1788 409.8718 424.3941 462.8014 512.8317 597.8570 614.0588 692.7008 752.4341 801.6362 815.9987 848.4571 868.4564 919.9628 941.9845 953.1872 971.0735 972.8602 982.6726 1026.6617 1084.4263 1132.3298 1158.4272 1168.7144 1186.2715 1191.6182 1283.5823 1320.7288 1331.1738 1339.1340 1376.0457 1384.4316 1394.3604 1432.5281 1464.1477 1467.3846 1474.6447 1484.8311 1487.7062 1507.9183 1587.8787 1625.0857 2968.9741 2975.3923 2979.0088 3068.1254 3077.4244 3087.4264 3094.4512 3105.6689 3121.5898 3134.2139 3151.9497 3166.0675 3553.1478
redmass: 3.6792 2.8460 2.9009 1.0343 3.6745 1.1243 2.8344 1.7839 1.5524 2.9236 2.7472 2.5479 2.7141 5.1759 6.3452 1.8371 1.8050 3.0744 1.2976 2.8738 1.5157 1.2346 1.4075 1.3611 1.4249 2.7290 2.7777 2.0397 1.5951 2.1946 1.8306 1.0846 1.7557 1.2843 1.6491 1.4542 1.5783 1.3073 1.2088 3.8148 1.2276 2.2656 1.0665 1.0521 1.2167 1.2776 1.2566 2.3512 4.9984 6.3549 1.0803 1.0398 1.0372 1.0982 1.0991 1.0997 1.0998 1.0869 1.0858 1.0930 1.0932 1.1005 1.0765
irintensity: 1.9268 0.7600 0.1243 0.2538 1.0209 0.1383 0.9084 18.4650 89.7767 0.1575 0.4176 3.8061 11.7845 0.3706 0.3128 42.1020 84.5211 5.6477 1.0322 2.2871 9.3583 4.8187 1.0605 0.0207 1.4949 6.1043 0.3656 6.2526 9.4141 13.6835 4.6148 1.9974 34.9023 44.1193 33.1553 9.4529 45.7126 0.9565 23.1171 49.5963 33.5716 13.3417 5.9496 2.7524 6.2819 17.7047 18.0584 187.0297 10.9061 201.2616 19.8562 24.1821 36.6144 9.8420 69.7795 27.0224 41.5984 16.7430 4.1502 32.7566 45.6257 12.9365 21.7405
temp: 298.150 k
press: 1.00000 atm
elementType: 7 6 6 6 6 6 6 6 6 6 1 1 1 1 1 1 1 1 1 1 1 1 1
symmnumber: 1
zpe: 519898.4 jmol-1
zpe.correction: 0.198019 hartree
zpe.thermalcorrener: 0.208160 hartree
zpe.thermalcorrenthalpy: 0.209104 hartree
zpe.thermalcorrgfe: 0.162755 hartree
zpe.sumelectzpe: -404.751849 hartree
zpe.sumelectthermal: -404.741708 hartree
zpe.sumelectthermalent: -404.740764 hartree
zpe.sumelectthermalfe: -404.787112 hartree
dipole: 2.3327 -0.5230 0.1487
dipole: 2.3953
quadrupole: -56.1917 -55.6488 -65.5370
quadrupole: -0.5880 -0.5964 -3.0410
quadrupole: 2.9341 3.4770 -6.4111 -0.5880 -0.5964 -3.0410
hfenergy: -404.9498674 hartree
pointgroup: C01 [X(C9H13N1)]
dipole: 0.9168381 -0.2089194 0.0619108 debye
dipolederiv: -1.7166886 0.0468165 -0.0293459 0.2737565 -0.2849113 -0.1662581 0.1006421 -0.1835088 -0.4718062 0.7662387 0.1599725 0.0261281 0.4746026 0.3359974 0.0757115 -0.128359 0.0946942 0.3710192 -0.1047287 0.0217056 0.0312018 -0.0061767 0.0325312 -0.0622567 0.0414137 -0.0683838 0.0612709 -0.097128 0.0300492 -0.0026751 -0.1073078 -0.0219049 -0.1112513 -0.0114145 -0.1579981 -0.0837567 1.6352885 -0.2295246 0.0471574 -0.5646926 0.0309775 0.0335857 0.0644587 0.0395967 0.1251718 -0.5117858 0.1378494 -0.0443147 -0.2591753 0.0569241 -0.0715213 0.0698388 -0.0796947 -0.2264684 -0.3410321 -0.0366956 0.019643 0.5123068 -0.0698376 -0.0400204 -0.1390274 -0.0474474 -0.2395083 0.216295 -0.115736 0.0198334 -0.0092084 0.2011893 -0.0894054 -0.0140027 -0.0787107 -0.1056471 0.2967417 0.1256265 -0.0479201 -0.0546548 0.1550093 -0.0788651 -0.0086388 -0.0757917 -0.1132895 -0.1658122 -0.069608 0.0077055 -0.0411539 -0.2914269 0.0195732 0.0080945 0.016625 -0.2476963 -0.0000119 0.0464015 -0.071042 -0.0562096 -0.0496056 0.0914533 -0.0146402 0.0694466 -0.1004365 0.1166038 -0.0087666 -0.0083939 -0.0647725 0.1051613 0.059859 -0.014768 0.1002416 0.2757725 -0.1182809 -0.0790881 0.0327374 -0.1375037 0.0018914 0.0320193 0.0201744 0.0153809 0.1022192 0.0804488 0.01427 0.0032091 0.0771102 -0.023201 0.0959644 -0.0556478 0.1436052 -0.067291 0.1035603 -0.0192931 -0.0464004 0.0159276 0.0024225 -0.1250316 -0.0156338 -0.1196553 -0.0846735 -0.028856 0.1153448 0.081055 0.1165152 0.0253505 -0.047784 0.0811838 -0.0267797 0.0575316 -0.0926162 -0.1406467 0.0166873 -0.194788 -0.0264193 0.0114241 0.0189284 0.0471007 0.0569783 0.0617345 0.0179598 -0.0700701 0.077876 -0.0117643 0.1300914 -0.0661475 0.0654162 -0.0545971 0.0365118 0.0974746 -0.0187005 0.0618555 -0.1027138 0.0651306 -0.00714 0.0645222 0.148976 -0.0300817 -0.1078866 0.0314415 -0.1205117 -0.002116 0.0362997 0.0455733 0.0423025 0.1505127 -0.0331564 -0.1102505 0.035037 -0.1241581 -0.0246016 0.0498879 0.0400352 0.0501328 0.1374098 0.064777 0.0509441 -0.0112499 0.076219 -0.1133828 0.0668202 -0.0157169 0.0645275 0.1342894 -0.1380215 0.0530813 -0.0017241 0.0541437 0.0744306 0.0245735 0.0007936 0.024378 0.1740195 unknown
polarizability: 148.7945911|-2.6546751|101.5148379|-1.0484388|-8.1091516|62.3685368 unknown
InChI: InChI=1S/C9H13N/c1-8(2)10-9-6-4-3-5-7-9/h3-8,10H,1-2H3
charge 0 multiplicity 1
23 atoms
N  1.135229 -0.69951 -0.000157
C  2.280661 0.200965 -0.217938
C  3.512148 -0.642653 -0.607435
C  2.575302 1.088036 1.0214
C  -0.209732 -0.319782 -0.015567
C  -1.216549 -1.291002 0.279051
C  -0.627922 1.00788 -0.335846
C  -2.580844 -0.947818 0.248341
C  -2.000729 1.334047 -0.366931
C  -2.991319 0.368779 -0.076167
H  2.033265 0.862774 -1.073407
H  1.349209 -1.655019 0.287241
H  4.388362 0.006795 -0.777393
H  3.773825 -1.349546 0.204485
H  3.321949 -1.221675 -1.528453
H  1.668618 1.628212 1.344898
H  3.362095 1.831499 0.794323
H  2.920087 0.464014 1.866652
H  -0.915734 -2.317462 0.527491
H  0.111192 1.782725 -0.562141
H  -3.330649 -1.714252 0.478035
H  -2.296162 2.359768 -0.618683
H  -4.053503 0.632727 -0.099398
