program: Gaussian 09
title: 000167665
version: EM64L-G09RevD.01
frameworkgroup: C1[X(C9H8N2O2)]
method: RPBEPBE
basis: SDD
operation: Freq
keyword: #pfreq=noraman
keyword: PBEPBE/SDD
title: #p freq=noraman PBEPBE/SDD
converged: NO NO NO NO
title: Mulliken charges:
elementType: O O N N C C C C C C C C C H H H H H H H H
charge: -0.438201 -0.320105 -0.370020 -0.739067 0.085100 0.383736 0.454948 -0.255639 -0.291285 -0.560788 0.187954 -0.220147 -0.208095 0.304520 0.298007 0.231243 0.246773 0.238673 0.279175 0.320163 0.373055
chargesum: 0.00000
title: Mulliken charges with hydrogens summed into heavy atoms:
elementType: O O N N C C C C C C C C C
charge: -0.065146 -0.320105 -0.065499 -0.139729 0.085100 0.383736 0.454948 -0.255639 0.006722 -0.329546 0.187954 0.026626 0.030578
polarizability: 1.92463922e+02 1.66289979e+00 1.55059768e+02 -3.65638803e-03 6.68619296e-03 4.69206524e+01
1716.lowfreq: -389.0069 -10.7982 -0.0008 -0.0007 -0.0006 3.0892 10.8290 103.8236 127.0821
frequency: -389.0064 103.8208 127.0807 168.3679 248.9208 252.4472 260.6037 283.4119 320.5840 359.4611 372.8258 398.3417 461.3004 505.2368 507.9712 560.6103 607.9785 616.1083 644.7373 666.0219 679.4373 701.5899 751.6722 796.5003 823.3889 857.2704 921.6062 965.0284 989.3405 1009.1396 1039.1409 1088.9716 1130.9389 1158.8919 1194.6404 1216.3963 1272.1216 1297.6908 1345.0792 1370.8277 1427.3180 1434.0360 1470.3861 1489.8474 1532.8375 1563.8542 1597.9410 1655.1069 1683.0965 3140.5290 3147.3624 3171.1322 3197.8656 3271.8929 3553.0809 3589.1889 3720.9011
redmass: 1.0585 7.9920 4.1803 5.3121 1.2241 4.8045 3.7462 4.7958 5.1067 3.6990 4.2356 8.6785 8.3185 4.2459 6.4712 2.3318 4.2295 1.7032 5.5698 2.7363 1.4721 6.9582 1.5296 2.4350 4.9622 1.6828 1.3159 4.0993 1.4217 2.0212 2.3699 2.5109 2.6023 1.6098 1.9297 1.5980 2.0338 1.6018 3.7781 2.5875 4.4701 2.3910 4.6151 3.3694 3.9818 3.7058 5.4276 1.1911 5.5991 1.0912 1.0913 1.0901 1.0991 1.0625 1.0763 1.0460 1.1027
irintensity: 65.7196 1.2741 13.1384 4.5506 164.7269 0.6897 36.4467 31.0792 2.4664 40.9230 7.2507 14.6857 6.8353 4.4975 2.3707 48.8538 4.6970 70.6906 9.2361 53.2826 87.5898 3.5770 58.5140 4.1105 19.0422 33.0377 1.2837 10.1849 2.5708 100.4756 15.5048 12.8205 38.8483 0.4556 107.6217 139.4357 25.2490 107.4360 246.9843 16.6494 524.9072 70.1898 77.2212 34.8957 112.6015 23.9552 50.9140 126.1599 101.1677 13.5124 0.1223 3.4557 6.1644 39.4566 39.3522 60.4978 13.6799
temp: 298.150 k
press: 1.00000 atm
elementType: 8 8 7 7 6 6 6 6 6 6 6 6 6 1 1 1 1 1 1 1 1
symmnumber: 1
zpe: 411048.1 jmol-1
zpe.correction: 0.156560 hartree
zpe.thermalcorrener: 0.167062 hartree
zpe.thermalcorrenthalpy: 0.168006 hartree
zpe.thermalcorrgfe: 0.121019 hartree
zpe.sumelectzpe: -606.777830 hartree
zpe.sumelectthermal: -606.767328 hartree
zpe.sumelectthermalent: -606.766384 hartree
zpe.sumelectthermalfe: -606.813371 hartree
dipole: -7.7237 5.1610 0.0016
dipole: 9.2893
quadrupole: -66.7639 -64.7022 -80.3959
quadrupole: 0.7933 -0.0006 0.0067
quadrupole: 3.8568 5.9185 -9.7753 0.7933 -0.0006 0.0067
hfenergy: -606.9343901 hartree
pointgroup: C01 [X(C9H8N2O2)]
dipole: -2.8722972 -2.2598224 -0.0006253 debye
dipolederiv: -1.4194118 -0.2866945 -0.0000455 -0.2383551 -0.2116574 0.0000151 -0.000015 0.0000205 -0.4041932 -0.674985 -0.3411639 -0.0000347 -0.7017448 -1.2758213 -0.0001566 0.0000355 0.0001157 -0.3733325 -0.538445 0.1475913 -0.0000101 -0.2942761 -0.649222 -0.0000733 -0.0000593 -0.0001095 -0.1787524 -0.0251425 -0.2753594 0.0004208 0.1045016 -1.4477432 0.0000694 0.0003244 0.0006126 -0.7855053 0.6392862 0.4267637 -0.0000143 -0.8130306 -0.0984721 -0.0000013 -0.000237 0.0001089 -0.0853557 -0.6537979 -0.4447702 0.000002 0.8329456 -0.2739496 0.0000093 0.0000536 -0.0000264 0.0748123 -0.6289282 -0.0124769 -0.0001546 0.3697704 1.5455193 0.0001513 -0.0000598 0.0001604 0.0916799 0.2193353 0.2269812 0.0000039 0.8988671 1.1525885 0.0001449 0.0000208 -0.0001685 -0.0061379 1.0552347 0.2746122 0.0000283 -0.1428596 0.1709889 0.0000138 0.0000086 0.0000304 -0.0334694 0.3340594 0.0110956 -0.0000038 0.021542 0.0746498 0.0000393 0.0000549 -0.00009 -0.2151222 1.3748592 0.5936364 0.000084 -0.0515107 -0.324449 -0.0000306 -0.0000299 -0.0000159 0.0921224 0.0435537 -0.210242 0.0000028 0.3585902 0.9656653 -0.000005 -0.000025 -0.000076 -0.0395954 -0.7196951 -0.3648382 -0.0000035 -0.4635626 -0.4934492 -0.0000257 -0.0000014 0.0000525 -0.2715573 0.1948807 0.0478395 -0.0000157 0.0306182 0.1456206 0.0000158 0.0001476 0.0000867 0.3087599 0.1052418 -0.066877 -0.0000076 -0.0008808 0.0228537 -0.0000029 0.0000195 -0.0000043 0.1450619 0.0249447 0.0861044 0.000031 0.1202425 -0.0266314 -0.0000323 0.0000145 -0.0000517 0.1668432 -0.042028 -0.0471005 0.0000116 -0.06555 0.0757919 0.0000129 -0.0000041 -0.0000267 0.1781574 -0.019785 0.0727587 -0.0000045 0.0781225 0.0350548 0.0000037 -0.0000135 0.000006 0.1909472 0.0395999 -0.0046506 -0.0002255 0.0248911 0.2098199 -0.0000445 -0.0002435 -0.0004136 0.395138 0.1356425 0.0001841 -0.0000809 -0.0239947 0.2286671 -0.0000898 -0.0000112 -0.0002145 0.3929657 0.5555805 0.166606 0.0000163 -0.044326 0.1741753 -0.0000132 0.0000203 0.0000035 0.3565336 unknown
polarizability: 192.4962854|1.2464625|155.0274051|0.0031273|0.0069494|46.9206524 unknown
InChI: InChI=1S/C9H8N2O2/c10-6-4-7(12)9(13)5-2-1-3-11-8(5)6/h1-4,11-12H,10H2
charge 0 multiplicity 1
21 atoms
O  3.40043 0.450611 0.00013
O  1.537225 2.379755 0.000175
N  -2.055301 -0.974899 0.000133
N  0.027038 -3.076314 -0.000276
C  -0.661713 -0.688291 0.000032
C  -0.303431 0.740462 0.000118
C  0.318367 -1.692494 -0.000095
C  1.101751 1.146068 0.000289
C  -1.317249 1.706808 0.000081
C  1.696105 -1.285789 -0.000022
C  2.066956 0.056056 0.000143
C  -3.029838 -0.013909 0.000105
C  -2.695498 1.344087 0.000025
H  -2.348393 -1.952801 0.000398
H  -1.004255 2.757029 0.000144
H  2.482891 -2.048949 -0.00017
H  -4.064056 -0.368042 0.000178
H  -3.488182 2.094112 -0.000009
H  -0.909025 -3.463732 -0.001222
H  0.795641 -3.738925 -0.000362
H  3.357239 1.458657 0.000207
