program: Gaussian 09
title: 000167718
version: EM64L-G09RevD.01
frameworkgroup: C1[X(C20H26NO4)]
method: RPBEPBE
basis: SDD
operation: Freq
keyword: #p
keyword: freq=noraman
keyword: PBEPBE/SDD
title: #p freq=noraman PBEPBE/SDD
converged: YES YES NO NO
title: Mulliken charges:
elementType: O O O O N C C C C C C C C C C C C C C C C C C C C H H H H H H H H H H H H H H H H H H H H H H H H H H
charge: -0.265420 -0.437048 -0.445381 -0.273887 -0.114196 -0.249273 -0.415336 0.359140 -0.558530 -0.636678 0.324620 -0.586335 -0.588834 -0.593639 0.605533 -0.500056 0.180874 0.188224 -0.584541 -0.429188 0.201412 -0.333731 0.179607 -0.492709 -0.504353 0.296098 0.266265 0.283917 0.256062 0.269346 0.240808 0.243858 0.261881 0.261124 0.304806 0.274213 0.269230 0.267037 0.264419 0.273799 0.234196 0.229608 0.267740 0.379901 0.253998 0.229496 0.243587 0.371019 0.223313 0.243384 0.260621
chargesum: 1.00000
title: Mulliken charges with hydrogens summed into heavy atoms:
elementType: O O O O N C C C C C C C C C C C C C C C C C C C C
charge: -0.265420 -0.057147 -0.074362 -0.273887 -0.114196 0.046825 0.134845 0.359140 -0.033122 -0.152013 0.324620 0.241475 0.221646 -0.329220 0.605533 -0.226257 0.180874 0.188224 -0.350345 -0.199580 0.201412 -0.065990 0.179607 0.234372 0.222965
polarizability: 2.82854636e+02 -2.78381343e+01 2.66194904e+02 2.71391475e+01 1.61168722e+01 1.70342592e+02
1716.lowfreq: -12.0572 -3.8292 -0.0008 -0.0005 0.0006 8.8598 17.4813 27.7105 34.5893
frequency: 17.0652 27.6568 34.4870 38.8080 52.2557 62.3322 71.8875 106.0900 121.1372 148.7279 156.5364 168.7009 188.5381 200.8785 218.9387 231.5453 239.9932 249.4396 255.3847 272.9736 284.1181 300.7443 303.6066 313.2652 319.8484 330.9744 353.2351 369.2799 376.2909 397.1659 403.3556 422.7072 428.2148 445.5001 454.0905 479.2448 488.8380 504.4343 551.1138 572.2005 572.3178 606.1427 633.9663 644.0451 695.3628 706.5407 712.0325 716.7396 720.1535 731.4800 746.6160 767.7125 819.6241 834.5229 844.3699 865.0763 880.9044 895.5101 909.5185 919.7434 936.9806 943.9184 956.5466 963.9381 985.3530 1011.5891 1030.4118 1055.9120 1079.9578 1091.7731 1097.8566 1107.7300 1111.5547 1120.3981 1142.6111 1148.1282 1150.6059 1154.3486 1167.6364 1175.0610 1183.6068 1193.3522 1201.2997 1231.9361 1235.3479 1237.5231 1273.8517 1280.0617 1283.6913 1289.8680 1291.6714 1297.6840 1315.2866 1332.0781 1350.1095 1370.1717 1395.8002 1397.2740 1415.1019 1415.8230 1417.9007 1440.7509 1444.1715 1447.7123 1456.4066 1457.3590 1459.3831 1459.5142 1462.0456 1462.4460 1470.0736 1473.2161 1481.8169 1485.4824 1497.4409 1510.2761 1519.2502 1587.3845 1590.0894 1613.3701 1618.8669 2983.8464 2998.9862 3002.9133 3009.0142 3009.5323 3024.0129 3026.5616 3032.4366 3041.4958 3070.2848 3104.0859 3106.1223 3111.8954 3118.5377 3118.7671 3121.9984 3133.4966 3136.8807 3146.2845 3147.2845 3151.3154 3152.0626 3159.1754 3171.9034 3576.1790 3579.5221
redmass: 5.9314 4.8792 3.3096 3.8618 2.4657 3.1789 3.9674 2.2521 2.8992 2.5022 1.8657 2.3254 2.6968 3.8681 1.7709 4.4465 1.8330 1.8508 1.7292 2.4817 2.2425 3.5206 2.6018 2.3144 2.4772 1.6041 4.1726 1.5142 2.1166 3.2465 4.0102 4.0199 4.2427 3.3794 3.1223 3.2894 3.1826 3.5333 4.9568 4.8053 4.7190 4.6002 4.1213 5.6120 5.0454 3.8743 4.3231 5.0077 3.7512 3.7038 3.4624 3.0236 1.4576 1.6040 1.4353 3.0218 1.7245 2.4888 2.4404 2.4916 2.1128 1.7816 6.5009 3.4692 2.4106 2.6255 2.4828 1.8754 2.2646 2.4031 1.3254 1.2399 1.2356 1.7731 1.4026 1.3843 1.5874 1.3049 1.4509 1.3374 1.3408 1.4314 1.5827 2.3950 1.5011 2.3627 1.5875 1.7482 1.8412 1.9092 1.5022 1.7552 2.0282 1.4252 1.6584 1.3136 4.4621 4.7049 2.6933 2.8574 1.1830 1.2862 1.1714 1.4426 1.0666 1.0577 1.0628 1.0757 1.0607 1.0755 1.0553 1.0694 1.0575 1.0753 1.0664 2.8606 3.1368 6.9463 6.8196 6.5014 6.9462 1.0647 1.0326 1.0603 1.0328 1.0801 1.0330 1.0348 1.0698 1.0854 1.1032 1.1063 1.0915 1.1001 1.0916 1.0901 1.1033 1.1051 1.1045 1.1060 1.1063 1.0919 1.1042 1.1040 1.0945 1.0663 1.0663
irintensity: 0.5317 1.2134 5.5174 2.5298 7.1894 1.3646 2.1174 1.9820 0.2177 2.3836 0.1024 3.3061 2.8554 0.2701 1.0583 1.9603 2.3960 2.1811 1.5532 1.0527 2.0441 2.7160 2.4690 16.9198 58.9071 161.1765 2.4763 21.0049 19.5974 5.1174 2.9486 2.8576 5.2189 11.0193 4.2843 18.9856 1.1144 0.4123 5.3373 1.6927 9.0523 10.9145 13.2209 2.4785 7.6289 8.3936 2.1824 0.7729 4.7379 6.2179 9.7886 15.1983 39.8271 25.7550 18.6139 58.0139 11.9142 43.3103 5.2907 13.5240 24.6765 18.9351 27.4868 17.6401 5.6150 9.3224 2.3939 1.8378 110.2927 71.6438 6.4656 1.0951 3.3911 36.8123 20.7009 54.6895 46.3990 9.1987 9.1521 19.5020 53.1046 4.5257 7.9177 81.0826 11.5242 242.1649 30.8626 12.8265 48.8633 60.6536 40.3485 157.9535 62.2350 14.8309 35.7383 2.0328 8.9378 13.9669 16.9354 35.1444 15.8810 1.6931 21.6802 1.1055 10.1795 16.8056 12.9579 21.1378 35.6066 12.1542 47.6544 16.2997 27.9096 19.2735 36.9477 121.4219 113.7097 57.4702 39.9187 21.6998 39.1655 20.2205 68.9932 25.3397 46.9271 12.3874 2.8990 6.9605 13.9562 14.1463 16.4010 7.7906 10.7549 27.2780 3.5426 14.3080 25.8784 1.5878 10.1894 12.1546 13.6390 0.8193 4.3106 0.7077 1.7139 48.5438 42.0821
temp: 298.150 k
press: 1.00000 atm
elementType: 8 8 8 8 7 6 6 6 6 6 6 6 6 6 6 6 6 6 6 6 6 6 6 6 6 1 1 1 1 1 1 1 1 1 1 1 1 1 1 1 1 1 1 1 1 1 1 1 1 1 1
symmnumber: 1
zpe: 1113707.7 jmol-1
zpe.correction: 0.424189 hartree
zpe.thermalcorrener: 0.449493 hartree
zpe.thermalcorrenthalpy: 0.450437 hartree
zpe.thermalcorrgfe: 0.368499 hartree
zpe.sumelectzpe: -1131.219089 hartree
zpe.sumelectthermal: -1131.193785 hartree
zpe.sumelectthermalent: -1131.192840 hartree
zpe.sumelectthermalfe: -1131.274779 hartree
dipole: 8.3319 -6.9744 0.0512
dipole: 10.8658
quadrupole: -90.9694 -103.6099 -132.5698
quadrupole: -28.6560 -5.9919 1.6761
quadrupole: 18.0803 5.4398 -23.5201 -28.6560 -5.9919 1.6761
hfenergy: -1131.6432774 hartree
pointgroup: C01 [X(C20H26N1O4)]
dipole: 2.2828956 -3.6131093 0.0937045 debye
polarizability: 266.4570521|-26.3105118|284.3404719|29.5055317|3.668965|168.594608 unknown
InChI: InChI=1S/C20H26NO4/c1-21(2)8-7-14-11-20(25-4)18(23)12-15(14)16(21)9-13-5-6-19(24-3)17(22)10-13/h5-6,10-12,16,22-23H,7-9H2,1-4H3
charge 1 multiplicity 1
51 atoms
O  3.044786 3.293901 0.133065
O  0.511392 2.892761 -1.304857
O  -3.170709 1.930135 1.480971
O  -4.866763 1.072828 -0.723853
N  1.889873 -3.082469 -0.222027
C  0.768208 -1.979779 -0.302539
C  2.741653 -2.837409 1.04149
C  1.419967 -0.602049 -0.266051
C  3.481803 -1.495283 0.984196
C  -0.329597 -2.156339 0.800706
C  2.635195 -0.355948 0.426785
C  2.751561 -3.003651 -1.482661
C  1.303157 -4.488538 -0.154939
C  0.740252 0.481971 -0.87098
C  -1.550952 -1.305833 0.465801
C  3.126496 0.964588 0.496312
C  1.215925 1.805179 -0.768553
C  2.445372 2.062607 -0.07983
C  -1.823742 -0.111605 1.171763
C  -2.409542 -1.675328 -0.59949
C  -2.920299 0.712409 0.827443
C  -3.511991 -0.867438 -0.938804
C  -3.791915 0.333502 -0.240843
C  2.753444 4.473154 -0.719184
C  -5.723048 1.858456 0.198965
H  0.293176 -2.156724 -1.28706
H  3.441341 -3.686595 1.128949
H  2.038022 -2.875401 1.888728
H  4.405974 -1.599684 0.382309
H  3.820676 -1.26111 2.010735
H  0.078449 -1.859765 1.783012
H  -0.644627 -3.213967 0.862987
H  3.630676 -3.654629 -1.356142
H  2.150008 -3.349458 -2.337598
H  3.063676 -1.964633 -1.649612
H  0.889292 -4.68076 0.844149
H  0.513342 -4.589535 -0.915395
H  2.108328 -5.21172 -0.358468
H  -0.202295 0.299664 -1.402515
H  4.071793 1.185334 1.003541
H  -1.155906 0.204559 1.984855
H  -2.243392 -2.6092 -1.151161
H  -4.196655 -1.146181 -1.745263
H  -0.348514 2.607069 -1.703205
H  1.735317 4.84797 -0.539159
H  2.87669 4.222261 -1.786389
H  3.505644 5.213078 -0.409575
H  -2.53458 2.078938 2.224113
H  -6.09115 1.217849 1.020567
H  -6.563388 2.186293 -0.430003
H  -5.177323 2.720124 0.610514
