program: Gaussian 09
title: 000167655
version: EM64L-G09RevD.01
frameworkgroup: C1[X(C13H14F3N)]
method: RPBEPBE
basis: SDD
operation: Freq
keyword: #p
keyword: freq=noraman
keyword: PBEPBE/SDD
title: #p freq=noraman PBEPBE/SDD
converged: YES YES NO NO
title: Mulliken charges:
elementType: F F F N C C C C C C C C C C C C C H H H H H H H H H H H H H H
charge: -0.164501 -0.167610 -0.169170 -0.077081 -0.499301 -0.417822 0.312362 -0.394641 -0.369955 0.356864 -0.618351 -0.469586 -0.372795 0.292128 -0.220794 -0.391543 0.229686 0.216836 0.231924 0.190271 0.220093 0.233983 0.186241 0.214299 0.188104 0.223478 0.229635 0.271323 0.233634 0.234635 0.267654
chargesum: 0.00000
title: Mulliken charges with hydrogens summed into heavy atoms:
elementType: F F F N C C C C C C C C C C C C C
charge: -0.164501 -0.167610 -0.169170 -0.077081 -0.050541 -0.007459 0.312362 0.025583 -0.155657 0.356864 0.022867 -0.198262 -0.139161 0.292128 0.013842 -0.123889 0.229686
polarizability: 2.23428783e+02 3.13341804e+00 1.47340081e+02 -5.47813278e+00 9.98675824e-01 8.73357477e+01
1716.lowfreq: -6.3446 -0.7698 -0.0009 -0.0004 0.0003 5.7381 15.6966 37.6870 54.6232
frequency: 14.1019 37.6048 54.6009 83.1010 118.9674 142.8900 188.4753 196.1845 235.0050 242.2446 259.2640 299.8959 305.3590 324.9785 338.1290 365.6319 404.9336 432.6249 445.9012 498.1485 512.1047 525.2496 556.1124 608.7170 624.3504 667.6557 695.4125 727.2224 759.4436 798.1400 811.6380 824.7780 904.2982 924.3061 941.0225 958.8799 965.2472 980.2565 985.2995 990.8499 995.5630 1009.0249 1043.9406 1061.8507 1077.8374 1085.7134 1108.7998 1114.9384 1150.0122 1183.1895 1191.2348 1210.9554 1233.4118 1253.8620 1287.8441 1302.5518 1315.7982 1317.9340 1342.6385 1366.4413 1378.4923 1388.3535 1424.8430 1434.1715 1450.2674 1454.3276 1466.5595 1478.5749 1482.9997 1488.1308 1594.3925 1614.6687 1664.1753 2779.4240 2840.6206 2858.2263 2974.1451 2978.6698 3019.1474 3028.0572 3035.7131 3078.3631 3122.3896 3137.1825 3156.2929 3160.6349 3177.8824
redmass: 12.5427 3.2299 3.9489 5.6373 5.2136 4.3285 4.2186 1.6991 1.4499 5.8678 2.3618 4.7039 3.3349 4.2556 3.4001 3.8816 2.9481 5.8855 4.1343 3.3100 5.2798 7.3873 4.6718 11.9380 4.4051 6.6056 1.9887 4.8707 3.9775 1.9461 1.6811 1.3614 1.6309 1.4488 2.6226 2.4664 2.3516 6.2243 5.4466 1.5128 2.2898 6.2093 1.8902 3.1554 2.0429 1.6243 1.7204 1.3424 2.1358 1.1591 1.0960 1.5185 2.4116 1.8112 1.7236 2.2472 1.4140 1.4585 1.4578 2.2335 1.5914 5.1215 3.3591 1.1749 1.1051 1.0817 1.0575 1.0833 1.0779 2.5242 5.8882 5.9309 6.9075 1.0715 1.0688 1.0593 1.0598 1.0830 1.0726 1.0981 1.0906 1.1008 1.0905 1.0867 1.0934 1.0915 1.0973
irintensity: 0.0069 0.0701 0.1555 0.8957 0.3321 0.9214 0.8978 3.4243 1.0576 0.4631 0.6272 1.7676 4.4387 2.9529 9.2112 0.3376 1.9000 0.5497 3.2251 1.6150 0.5471 1.4973 0.2551 18.3104 0.5177 3.8688 23.3604 16.2056 16.8937 47.9522 49.2470 4.6665 23.9097 14.8702 14.8754 8.9158 23.4836 191.0369 29.5111 13.1071 6.9494 138.4865 27.7814 80.3035 9.7944 30.8036 3.7573 10.4156 18.1163 12.4404 0.0450 1.0018 94.7355 41.1231 37.0160 177.4915 26.6779 10.2015 0.3458 15.9953 12.5905 9.0634 24.3661 0.6515 2.9452 26.6202 14.0846 13.1947 12.3411 9.4426 8.1189 17.9837 24.2251 85.2871 58.4334 221.4676 24.0528 31.9542 51.2920 26.0133 40.6860 30.1428 19.3224 3.9863 15.3475 0.9636 5.8109
temp: 298.150 k
press: 1.00000 atm
elementType: 9 9 9 7 6 6 6 6 6 6 6 6 6 6 6 6 6 1 1 1 1 1 1 1 1 1 1 1 1 1 1
symmnumber: 1
zpe: 634435.1 jmol-1
zpe.correction: 0.241644 hartree
zpe.thermalcorrener: 0.257228 hartree
zpe.thermalcorrenthalpy: 0.258172 hartree
zpe.thermalcorrgfe: 0.197044 hartree
zpe.sumelectzpe: -856.786529 hartree
zpe.sumelectthermal: -856.770945 hartree
zpe.sumelectthermalent: -856.770001 hartree
zpe.sumelectthermalfe: -856.831129 hartree
dipole: -4.2593 2.7366 -0.9852
dipole: 5.1577
quadrupole: -99.3485 -91.5345 -104.3975
quadrupole: 7.7190 0.8193 1.4301
quadrupole: -0.9217 6.8923 -5.9707 7.7190 0.8193 1.4301
hfenergy: -857.028173 hartree
pointgroup: C01[X(C13H14F3N1)]
dipole: -1.6651144 -1.1111384 0.3321539 debye
polarizability: 223.4386102|-2.5346824|147.0739565|5.9699497|3.650145|87.5920445 unknown
InChI: InChI=1S/C13H14F3N/c1-17-7-5-10(6-8-17)11-3-2-4-12(9-11)13(14,15)16/h2-5,9H,6-8H2,1H3
charge 0 multiplicity 1
31 atoms
F  4.717437 0.456648 -0.00696
F  3.28442 1.747852 -1.20182
F  3.290596 1.864963 1.056196
N  -4.15186 0.647993 -0.282501
C  -1.822849 1.105675 0.423552
C  -3.314845 1.239672 0.782818
C  -1.466994 -0.326737 0.036439
C  -3.921057 -0.802768 -0.423726
C  -2.461199 -1.181119 -0.346193
C  -0.035016 -0.737556 0.065482
C  -5.582472 0.976073 -0.160551
C  0.992348 0.240902 0.01705
C  0.361966 -2.105527 0.150614
C  2.355308 -0.136205 0.030656
C  1.719562 -2.475707 0.161194
C  2.734026 -1.493807 0.098638
C  3.39256 0.946183 -0.029005
H  -1.210076 1.433352 1.286347
H  -1.595444 1.790492 -0.417514
H  -3.503057 0.756478 1.777377
H  -3.581678 2.307901 0.881868
H  -4.335393 -1.1334 -1.398242
H  -4.476303 -1.392411 0.360032
H  -2.229021 -2.209623 -0.650427
H  -6.055259 0.57006 0.770298
H  -6.133026 0.565275 -1.026371
H  -5.714986 2.072382 -0.162773
H  0.733876 1.302293 -0.046553
H  -0.402408 -2.885377 0.233305
H  1.994478 -3.533234 0.231514
H  3.790668 -1.774926 0.111557
