program: Gaussian 09
title: 000167651
version: EM64L-G09RevD.01
frameworkgroup: C1[X(C11H15N)]
method: RPBEPBE
basis: SDD
operation: Freq
keyword: #pfreq=noraman
keyword: PBEPBE/SDD
title: #p freq=noraman PBEPBE/SDD
converged: YES YES NO NO
title: Mulliken charges:
elementType: N C C C C C C C C C C C H H H H H H H H H H H H H H H
charge: -0.645570 0.226160 -0.517493 -0.552655 -0.433040 -0.443221 0.420724 -0.410986 -0.417544 -0.250436 -0.222296 -0.248295 0.236189 0.203043 0.232944 0.245402 0.216796 0.213462 0.217873 0.216932 0.258394 0.282768 0.217932 0.288619 0.219704 0.220279 0.224315
chargesum: 0.00000
title: Mulliken charges with hydrogens summed into heavy atoms:
elementType: N C C C C C C C C C C C
charge: -0.104408 0.226160 -0.078261 -0.074309 -0.002782 -0.008416 0.420724 -0.193055 -0.128926 -0.030732 -0.002017 -0.023980
polarizability: 1.57693990e+02 -3.53558150e-01 1.17165853e+02 -9.65951934e-01 7.41275520e-01 8.07332427e+01
1716.lowfreq: -20.2484 -10.6800 -0.0006 -0.0006 0.0004 7.7077 33.9973 64.1357 105.9985
frequency: 33.6993 63.3671 105.9706 135.4861 221.2985 249.7101 271.0020 319.3264 369.9562 403.2701 409.3437 464.0597 534.2153 601.2240 617.2526 644.4945 668.6901 708.0129 715.8916 764.5837 788.9735 813.0296 856.3674 883.9584 906.5896 923.2233 934.5856 956.7159 980.8457 989.4149 1005.9647 1020.5602 1027.2550 1031.0492 1041.8111 1067.4270 1079.1865 1157.8227 1167.9367 1168.6203 1182.7164 1198.5199 1224.1840 1237.9274 1267.3189 1280.5200 1296.3199 1304.9983 1306.6297 1329.0653 1378.5357 1431.3013 1458.9694 1469.0840 1472.4162 1478.8875 1492.8461 1587.3158 1610.1956 1636.5232 2991.3280 2995.5474 3006.9593 3018.7789 3040.2673 3054.3271 3069.6159 3083.9919 3114.1013 3122.6172 3136.1205 3152.5858 3163.6713 3442.6327 3572.5597
redmass: 3.3694 1.7435 3.0329 2.7784 1.1724 2.7532 3.3993 4.9405 2.4121 2.4407 2.7932 3.0831 3.0127 1.7378 6.2302 3.6480 2.2070 1.7605 2.0412 1.8503 1.5607 1.9110 1.2596 2.6073 2.5585 1.5944 1.7021 2.1411 1.3586 5.7301 1.3430 1.7204 2.1288 1.7677 2.0241 2.2340 1.5932 1.8067 1.3689 1.1169 1.1444 1.5505 1.2429 1.7688 1.4595 1.4230 1.4224 1.3501 1.4569 1.6741 8.4499 2.2347 1.1046 1.1980 1.0822 1.8176 1.1025 6.1129 5.8326 1.1107 1.0587 1.0606 1.0622 1.0646 1.1010 1.1024 1.1042 1.1044 1.0846 1.0874 1.0935 1.0960 1.0981 1.0451 1.0967
irintensity: 0.0733 0.1352 1.7874 1.5052 35.2940 6.7307 0.5487 1.1524 6.6891 5.6133 0.6235 3.1258 13.4179 94.5876 0.2975 12.9744 98.0912 51.5211 4.8211 44.4356 6.5673 2.8583 0.5945 3.0721 2.1105 6.6185 2.1912 5.4612 0.4817 0.1345 1.7274 8.1696 9.4431 7.5754 2.0981 5.5916 2.4376 4.0408 3.0151 1.3910 4.8302 0.9698 3.1272 13.0025 0.9908 1.4261 4.6724 1.1157 3.7773 21.4841 1.1750 8.9860 6.3089 3.6513 10.1887 25.1756 4.8041 0.9179 8.6624 46.7593 6.0073 65.8948 69.4285 15.6105 15.2700 7.9762 27.1880 70.5452 7.3086 4.0298 43.3215 22.8416 21.6320 0.9471 0.7691
temp: 298.150 k
press: 1.00000 atm
elementType: 7 6 6 6 6 6 6 6 6 6 6 6 1 1 1 1 1 1 1 1 1 1 1 1 1 1 1
symmnumber: 1
zpe: 614351.6 jmol-1
zpe.correction: 0.233994 hartree
zpe.thermalcorrener: 0.245054 hartree
zpe.thermalcorrenthalpy: 0.245998 hartree
zpe.thermalcorrgfe: 0.196705 hartree
zpe.sumelectzpe: -482.013751 hartree
zpe.sumelectthermal: -482.002692 hartree
zpe.sumelectthermalent: -482.001747 hartree
zpe.sumelectthermalfe: -482.051040 hartree
dipole: 1.6811 -0.3038 -0.5496
dipole: 1.7946
quadrupole: -66.7695 -68.5161 -75.1411
quadrupole: 1.8502 -0.5654 -2.0550
quadrupole: 3.3727 1.6261 -4.9989 1.8502 -0.5654 -2.0550
hfenergy: -482.2477455 hartree
pointgroup: C01 [X(C11H15N1)]
dipole: -0.6524828 0.2665779 -0.0413032 debye
polarizability: 157.552145|-3.113465|96.0020046|0.8266514|17.9518998|102.0389361 unknown
InChI: InChI=1S/C11H15N/c12-11(8-4-5-9-11)10-6-2-1-3-7-10/h1-3,6-7H,4-5,8-9,12H2
charge 0 multiplicity 1
27 atoms
N  -1.286845 -0.824135 -1.569211
C  -0.958221 -0.10928 -0.307831
C  -1.669003 1.288298 -0.240949
C  -1.664468 -0.864789 0.864085
C  -3.16132 0.954304 0.028964
C  -3.14867 -0.383156 0.84917
C  0.569916 -0.040633 -0.118351
C  1.148708 0.76482 0.900056
C  1.436231 -0.822184 -0.923596
C  2.54654 0.797349 1.096936
C  2.836534 -0.789425 -0.73206
C  3.400487 0.022469 0.277513
H  -1.5114 1.864972 -1.171188
H  -1.260852 1.891652 0.590996
H  -1.17543 -0.582153 1.812545
H  -1.554432 -1.957679 0.749639
H  -3.703602 0.816231 -0.924697
H  -3.67065 1.770547 0.571295
H  -3.51872 -0.228104 1.878449
H  -3.815434 -1.13458 0.386885
H  -1.128412 -0.261912 -2.413514
H  -2.219083 -1.249141 -1.56631
H  0.510482 1.370771 1.554142
H  0.982306 -1.463717 -1.6850
H  2.969449 1.42612 1.889248
H  3.48627 -1.402814 -1.367631
H  4.48582 0.049069 0.428115
