program: Gaussian 09
title: 000167687
version: EM64L-G09RevD.01
frameworkgroup: C1[X(C21H18O6)]
method: RPBEPBE
basis: SDD
operation: Freq
keyword: #pfreq=noraman
keyword: PBEPBE/SDD
title: #p freq=noraman PBEPBE/SDD
converged: YES YES NO NO
title: Mulliken charges:
elementType: O O O O O O C C C C C C C C C C C C C C C C C C C C C H H H H H H H H H H H H H H H H H H
charge: -0.216678 -0.210675 -0.292517 -0.297587 -0.261887 -0.259652 -0.235334 -0.663615 -0.030397 0.198487 -0.347661 0.437877 0.169855 0.116876 0.341499 -0.627955 -0.525232 0.207612 0.182358 -0.487268 -0.388739 0.189651 -0.346616 0.162411 -0.206489 -0.530346 -0.529686 0.275653 0.242082 0.230234 0.228986 0.221757 0.264006 0.290598 0.281078 0.259306 0.253464 0.236635 0.240390 0.260766 0.232653 0.225182 0.233978 0.226912 0.248030
chargesum: 0.00000
title: Mulliken charges with hydrogens summed into heavy atoms:
elementType: O O O O O O C C C C C C C C C C C C C C C C C C C C C
charge: -0.216678 -0.210675 -0.292517 -0.297587 -0.261887 -0.259652 0.040319 -0.191299 -0.030397 0.198487 0.103083 0.437877 0.169855 0.116876 0.341499 -0.363949 -0.234634 0.207612 0.182358 -0.206190 -0.129433 0.189651 -0.093153 0.162411 0.270536 0.188254 0.179234
polarizability: 3.56828454e+02 -4.28105980e+00 3.05325838e+02 -1.43471178e+01 -6.76458340e+00 1.54931941e+02
1716.lowfreq: -6.1336 -2.9496 -0.0004 0.0002 0.0005 5.2083 31.1348 35.0607 42.4551
frequency: 31.0974 35.0338 42.4538 53.6256 59.6131 77.6835 104.6174 108.8342 112.2497 136.9795 148.2693 161.3666 165.0915 172.9186 181.6264 199.5847 220.1553 239.3635 255.6144 266.4845 272.6731 290.5977 305.1208 343.7616 375.8448 410.8489 418.8946 421.8314 441.9237 474.8888 498.4782 526.7038 536.0706 556.7613 576.3907 612.0920 627.4469 639.9501 656.0923 664.1963 677.2876 704.0755 714.9319 724.6382 729.9018 743.9542 754.3994 778.1478 804.8223 813.1661 834.2271 836.5023 878.3165 887.6990 903.6459 916.9991 922.9318 929.1076 940.0806 949.2572 956.2589 971.5158 983.1916 1010.0626 1058.5156 1070.6948 1073.3495 1081.6726 1092.6954 1113.4911 1115.2708 1129.2084 1133.6007 1149.3054 1150.1245 1163.1769 1171.4855 1175.0236 1186.4394 1190.2249 1226.3450 1237.9987 1260.6375 1269.1270 1271.8544 1297.9558 1310.6254 1330.3963 1348.4293 1357.6401 1361.3054 1375.1139 1388.5778 1427.1624 1444.3642 1446.5129 1450.3018 1457.4706 1460.2922 1475.2630 1475.8067 1479.6580 1485.6554 1485.9606 1487.7582 1539.5994 1598.1068 1608.6839 1613.2572 1621.4018 1662.0520 2945.5373 2960.9288 2972.3595 2979.2618 3001.0531 3001.8705 3041.8336 3067.5058 3078.5318 3096.5953 3114.6070 3122.9221 3128.2970 3145.7226 3149.8395 3166.4735 3183.2320 3197.5322
redmass: 5.2223 5.3905 5.5777 4.2651 4.8920 4.0081 2.6960 3.4736 3.2115 4.5093 1.2302 1.2241 2.9928 5.4257 3.6258 4.3560 3.9968 6.5674 6.6233 4.5151 5.7478 5.5280 5.5201 6.4754 4.7666 4.2749 4.3100 3.9464 5.3107 3.4381 3.7020 6.2370 6.2700 6.4724 6.6842 5.4974 5.2468 7.2092 6.2110 5.0760 8.7577 7.6218 5.2362 6.1240 5.2001 4.6941 4.0142 6.1557 5.6321 1.7333 3.8760 5.4844 1.5554 1.6256 4.1187 1.6246 1.6505 2.8886 1.3843 7.0821 7.6238 5.5320 4.9277 2.4140 3.3262 3.0977 1.5061 2.7577 3.7141 1.2512 1.2496 1.1225 1.5217 1.5967 1.3550 1.3908 1.7441 1.7139 1.4054 2.3272 3.0902 1.3054 1.6303 1.5312 2.4057 1.5842 3.5243 1.8065 1.5947 4.2831 1.4967 3.8838 3.2760 1.1969 1.7802 2.4617 1.1228 1.0577 1.0650 1.8910 1.0634 1.0954 2.1082 1.9964 1.0611 8.5201 9.7730 8.2267 7.7376 8.1365 12.7122 1.0709 1.0777 1.0305 1.0311 1.0641 1.0611 1.0947 1.1048 1.1033 1.1027 1.1102 1.1024 1.1035 1.0917 1.0894 1.0912 1.0959 1.0938
irintensity: 1.1915 0.5358 1.0642 3.5576 3.0467 1.5012 18.5450 3.6668 3.8060 2.6634 0.7869 0.6423 2.0828 4.8824 2.3004 3.5351 1.6709 1.6535 2.4215 12.2362 7.2496 4.6980 1.3089 1.2524 7.2246 0.7620 1.2251 7.0492 11.9494 4.7926 2.6731 4.3456 2.7908 8.1798 0.7039 1.3052 28.1758 4.7318 4.0813 1.4368 0.1554 2.1745 2.1709 13.4424 11.4557 15.3859 15.2414 20.4477 15.9113 41.9998 43.3037 9.9619 9.6900 9.1629 9.9849 1.8625 41.0092 16.7105 11.7989 34.4366 143.1471 155.9782 229.6482 37.8205 11.9051 1.2745 9.3732 19.4723 131.0241 32.9445 0.6477 1.0976 25.8388 2.1990 4.7307 18.1646 12.5064 4.3384 35.8668 155.3597 196.1029 18.9465 60.4723 9.1478 86.8667 32.0682 259.8301 4.3809 2.0771 3.0494 5.3942 27.1451 13.4768 0.9509 47.6837 63.1714 23.9936 16.1063 5.4351 88.2188 3.2984 4.6294 54.4411 75.8029 15.5786 134.2691 134.8707 42.9038 28.4645 16.8124 314.2395 14.1679 21.6050 69.2235 88.6259 86.3549 120.6457 28.9604 27.3615 22.5856 32.2721 29.6212 23.4401 22.5531 6.4473 5.8366 1.2382 4.5334 0.2460
temp: 298.150 k
press: 1.00000 atm
elementType: 8 8 8 8 8 8 6 6 6 6 6 6 6 6 6 6 6 6 6 6 6 6 6 6 6 6 6 1 1 1 1 1 1 1 1 1 1 1 1 1 1 1 1 1 1
symmnumber: 1
zpe: 899903.1 jmol-1
zpe.correction: 0.342755 hartree
zpe.thermalcorrener: 0.366387 hartree
zpe.thermalcorrenthalpy: 0.367332 hartree
zpe.thermalcorrgfe: 0.288896 hartree
zpe.sumelectzpe: -1260.393769 hartree
zpe.sumelectthermal: -1260.370136 hartree
zpe.sumelectthermalent: -1260.369192 hartree
zpe.sumelectthermalfe: -1260.447628 hartree
dipole: -5.6985 -2.0914 0.1320
dipole: 6.0716
quadrupole: -147.4225 -150.9701 -150.0209
quadrupole: -15.7594 -2.8361 3.2793
quadrupole: 2.0487 -1.4990 -0.5497 -15.7594 -2.8361 3.2793
hfenergy: -1260.7365239 hartree
pointgroup: C01 [X(C21H18O6)]
dipole: -2.1941974 -0.9175551 0.2231662 debye
polarizability: 356.0018682|-4.0669413|301.7357157|-20.2358437|-23.1122237|159.3486486 unknown
InChI: InChI=1S/C21H18O6/c1-23-16-7-12-5-13-9-25-21(22)20(13)19(14(12)8-17(16)24-2)11-3-4-15-18(6-11)27-10-26-15/h3-4,6-8,13H,5,9-10H2,1-2H3
charge 0 multiplicity 1
45 atoms
O  1.337612 4.333388 -0.687734
O  2.898841 2.632131 -0.442678
O  -5.17436 -0.993906 0.311348
O  -2.979685 -2.918664 -0.068352
O  4.626667 -1.470652 -1.186581
O  4.591137 -2.748261 0.84122
C  -0.739948 3.080033 -0.735998
C  -1.919342 2.756726 0.195132
C  0.442583 2.163735 -0.443778
C  0.263871 0.83559 -0.101536
C  -0.135964 4.493497 -0.553332
C  -2.224632 1.267018 0.129881
C  -1.138852 0.339206 -0.003771
C  1.696919 2.95606 -0.507331
C  1.384337 -0.111912 0.175295
C  -3.541163 0.784794 0.2449
C  -1.437095 -1.048233 -0.070416
C  -3.826148 -0.599283 0.214363
C  -2.758509 -1.522389 0.014322
C  2.472323 -0.238741 -0.741825
C  1.363796 -0.897474 1.362345
C  3.481349 -1.139397 -0.415315
C  2.40845 -1.800542 1.688172
C  3.460544 -1.899885 0.774581
C  5.456604 -2.315949 -0.293749
C  -5.489642 -1.943884 1.407215
C  -3.731631 -3.342595 -1.273883
H  -1.058532 2.939351 -1.790455
H  -2.8137 3.348853 -0.070957
H  -1.640566 3.03497 1.234679
H  -0.450513 5.221043 -1.317239
H  -0.342946 4.896823 0.456251
H  -4.381479 1.475518 0.373672
H  -0.640248 -1.782574 -0.2180
H  2.51763 0.352941 -1.657145
H  0.527372 -0.786269 2.059594
H  2.39095 -2.390181 2.607678
H  6.292011 -1.711193 0.106991
H  5.790577 -3.206542 -0.846844
H  -4.861318 -2.849123 1.343175
H  -6.552694 -2.194586 1.274925
H  -5.337197 -1.448842 2.384479
H  -3.844947 -4.433154 -1.180273
H  -3.153982 -3.100469 -2.185709
H  -4.72168 -2.852676 -1.316817
