program: Gaussian 09
title: 000167641
version: EM64L-G09RevD.01
frameworkgroup: C1[X(C12H9N3O3)]
method: RPBEPBE
basis: SDD
operation: Freq
keyword: #p
keyword: freq=noraman
keyword: PBEPBE/SDD
title: #p freq=noraman PBEPBE/SDD
converged: YES YES NO NO
title: Mulliken charges:
elementType: O O O N N N C C C C C C C C C C C C H H H H H H H H H
charge: -0.171644 -0.439817 -0.234905 -0.359932 -0.085803 0.014736 0.179726 0.097452 -0.353222 0.121604 -0.313417 -0.218776 -0.219229 0.080590 0.090993 -0.270045 -0.258455 -0.165347 0.265512 0.283596 0.240332 0.240020 0.346525 0.248877 0.253075 0.238034 0.389521
chargesum: 0.00000
title: Mulliken charges with hydrogens summed into heavy atoms:
elementType: O O O N N N C C C C C C C C C C C C
charge: -0.171644 -0.050296 -0.234905 -0.013407 -0.085803 0.014736 0.179726 0.097452 -0.087710 0.121604 -0.029821 0.021556 0.020791 0.080590 0.090993 -0.021168 -0.005380 0.072687
polarizability: 2.44708700e+02 1.48616725e+01 1.48815299e+02 1.55759517e+01 -1.04419434e+01 1.01637051e+02
1716.lowfreq: -5.6959 -5.0806 -0.0008 -0.0006 0.0003 0.6546 14.5780 25.0779 37.8625
frequency: 14.0684 24.9321 37.8378 60.0614 76.0591 120.8877 137.6411 162.1156 218.9529 243.0979 259.9967 327.2851 362.3353 384.3049 399.3471 414.9873 482.8131 517.6052 530.8880 590.3060 597.9689 607.2630 621.0288 665.6469 685.6005 703.0666 718.5956 756.7939 774.7230 792.2499 793.2392 815.2799 842.7899 870.8775 902.6532 942.8269 957.2537 978.2797 978.8307 1000.0255 1007.5497 1037.3511 1053.0889 1080.3971 1086.8524 1116.8153 1161.3985 1180.0378 1194.3577 1239.7341 1264.0516 1279.1291 1316.1386 1346.8199 1378.8841 1388.0914 1424.5742 1429.1251 1472.6347 1485.6845 1530.1351 1551.6380 1573.3601 1601.7758 1627.3134 1639.4868 3138.8034 3139.6844 3141.8652 3153.9517 3167.6602 3184.9446 3186.3948 3521.7853 3530.9803
redmass: 7.8475 5.6316 8.0527 7.4137 6.3365 4.9768 7.3298 6.5539 5.8274 6.3341 5.5781 8.9678 6.8172 7.2420 4.1056 3.2482 5.6661 2.6088 5.6770 1.8084 2.2471 5.1248 7.1909 6.0029 3.9493 2.6413 1.6512 6.3506 2.7636 1.8928 1.8908 2.3591 5.7328 5.9515 1.5246 8.7750 1.3768 1.4512 1.4016 5.3359 1.3557 2.9997 2.6698 1.9428 2.3009 1.8189 1.7686 1.0759 2.1338 3.0534 3.3163 1.5830 2.5641 1.8651 10.4423 1.6192 2.2914 2.7555 2.5525 2.7877 4.0460 4.6294 6.9477 6.1547 7.2478 8.8081 1.0865 1.0899 1.0933 1.0914 1.0973 1.0969 1.0993 1.0761 1.0642
irintensity: 1.6030 0.2127 3.1131 0.4508 0.9342 2.9346 2.9505 1.7337 7.6493 1.7077 2.4086 6.3272 3.4478 13.1225 0.0167 11.1955 17.4397 7.6086 2.5579 104.7318 49.8793 10.9202 8.4223 3.3611 46.6635 32.2540 78.0709 8.8641 21.4068 25.0833 4.9023 80.2230 8.4185 18.4402 0.1178 6.2040 0.0351 0.5152 3.2650 266.2229 1.4145 21.2399 5.2870 13.2533 25.1087 79.4614 70.4048 0.0484 28.0588 126.7504 5.1352 29.8451 81.1679 6.0510 20.9925 9.3388 168.4106 263.6825 121.8268 683.9472 216.2515 67.5766 25.8705 23.8126 143.7976 241.5894 2.1068 17.5941 19.2143 9.6921 13.4685 8.7568 18.4053 26.7088 52.9255
temp: 298.150 k
press: 1.00000 atm
elementType: 8 8 8 7 7 7 6 6 6 6 6 6 6 6 6 6 6 6 1 1 1 1 1 1 1 1 1
symmnumber: 1
zpe: 508430.9 jmol-1
zpe.correction: 0.193651 hartree
zpe.thermalcorrener: 0.208783 hartree
zpe.thermalcorrenthalpy: 0.209727 hartree
zpe.thermalcorrgfe: 0.147939 hartree
zpe.sumelectzpe: -851.355470 hartree
zpe.sumelectthermal: -851.340339 hartree
zpe.sumelectthermalent: -851.339395 hartree
zpe.sumelectthermalfe: -851.401182 hartree
dipole: -0.7113 1.4194 -3.4647
dipole: 3.8112
quadrupole: -68.5736 -94.2357 -110.2443
quadrupole: 3.4366 0.5935 5.7491
quadrupole: 22.4443 -3.2178 -19.2264 3.4366 0.5935 5.7491
hfenergy: -851.5491215 hartree
pointgroup: C01 [X(C12H9N3O3)]
dipole: -0.2356563 -0.0364244 1.4803425 debye
dipolederiv: -0.7322326 -0.0269248 0.1122604 0.0773993 -0.3214802 0.154582 -0.4829533 0.118945 -0.8412612 -0.6411973 -0.4643044 0.1479087 -0.4967913 -0.9867165 0.2960753 0.2024716 0.3458451 -0.5443732 -0.942248 0.1446756 0.2097983 0.0802384 -0.7622807 -0.0329256 0.2097434 0.0187262 -0.3641492 -2.390481 0.1993989 -0.4158088 0.2976275 -0.3383366 0.0350235 -0.6722456 0.0249907 -0.4922501 -1.0315622 0.0651121 0.0242919 0.2216358 -0.2438062 0.044406 -0.5042881 0.0874267 -0.4212516 -1.0045009 0.0803312 -0.0327826 -0.0549481 -0.1864763 0.0340312 0.5325095 -0.0233858 -0.2664109 -0.1028118 0.0894124 -0.0035303 -0.0732305 0.1561708 0.0138303 0.0649812 -0.0805782 -0.0786449 -0.0976173 0.2358088 0.011427 0.2030009 -0.5668258 0.0585732 -0.1015543 0.0489859 0.0109574 -0.2935753 0.156664 -0.0113795 0.1298964 -0.0230185 -0.0728979 0.018585 -0.118584 -0.0946583 2.02759 -0.0695243 0.1403804 -0.2527676 0.3226765 -0.2362145 1.2039023 -0.172796 1.2249945 -0.127203 -0.1294309 0.0074173 0.0984321 0.0871564 -0.0684294 -0.0458385 0.0111083 -0.0814083 0.1283254 -0.092558 -0.0422342 -0.0050098 0.1344148 -0.0545774 -0.0992229 -0.0262218 -0.0836231 0.0994403 -0.036155 -0.0911016 -0.1657274 -0.2015509 0.0416105 -0.0574962 0.0273932 -0.1315671 2.3743799 -0.2071442 0.1778908 -0.183713 0.2221425 -0.0167261 -0.1145232 0.0095997 0.1993012 1.3057829 -0.0355973 -0.4220788 0.0428156 1.7953721 -0.2818396 -0.4494045 -0.3200254 0.4512969 0.5566285 -0.0363015 -0.11049 -0.1163669 0.0064919 -0.1145648 0.1265341 -0.133899 0.43518 0.5770348 -0.0879099 0.085073 -0.0206981 0.0064031 -0.1355605 -0.1807336 -0.1091269 0.4327418 -0.2111046 -0.0005119 0.000884 0.0110913 -0.1248688 0.1049207 0.0280328 0.0979299 -0.4849859 0.0759708 -0.067424 0.0490754 -0.0602214 0.0242626 0.033409 0.0345922 0.0630016 0.1193935 0.0711864 -0.05151 0.036101 -0.0545056 0.059745 0.0408855 0.0505609 0.0302938 0.1368696 0.0494749 0.0773956 0.0130417 0.0998048 -0.0615412 0.0225508 0.0266048 0.0244843 0.1427246 -0.0884928 0.0416348 0.073478 0.02728 0.083646 0.0057727 0.0848822 0.0018562 0.1305886 0.2226504 0.002397 -0.0058846 0.0195396 0.2541645 0.0568334 0.0693606 0.0356025 0.172879 0.0281825 0.025868 -0.0691113 0.0390953 0.0995755 0.0493066 -0.1102067 0.052494 -0.0380498 0.0075287 -0.0077233 0.0725406 -0.0214054 0.1111365 0.0288158 0.1220124 0.0247377 -0.0206132 -0.1021584 0.0343568 -0.0006624 0.0376047 0.169999 0.0181018 -0.003168 0.0181421 0.1133735 0.2410096 0.1599641 0.0434956 0.1199235 0.2835448 -0.0249927 0.0468619 -0.0569457 0.3729462 unknown
polarizability: 243.377388|-21.7719722|136.6462905|-13.5928969|-22.6330682|115.1373721 unknown
InChI: InChI=1S/C12H9N3O3/c16-10(15-12-13-6-3-7-14-12)8-4-1-2-5-9(8)11(17)18/h1-7,15,17H
charge 0 multiplicity 1
27 atoms
O  0.177803 0.87513 -1.991839
O  -2.560043 -2.72622 0.861791
O  -0.57647 -2.145118 -0.185253
N  0.862761 0.366992 0.217195
N  2.810301 -0.171055 1.342913
N  2.920967 0.457016 -1.023507
C  -1.517004 0.680748 -0.275465
C  -2.272005 -0.420413 0.232953
C  -2.142228 1.947248 -0.383237
C  -0.083041 0.609876 -0.792719
C  -3.615193 -0.218439 0.652763
C  -3.474031 2.139521 0.041249
C  -4.211598 1.053812 0.568618
C  2.254074 0.215784 0.141723
C  -1.6937 -1.794195 0.26463
C  4.159512 -0.340057 1.347887
C  4.272281 0.271029 -0.976323
C  4.952834 -0.135068 0.193505
H  -1.572475 2.779012 -0.809579
H  -4.178218 -1.076394 1.028353
H  -3.933976 3.129853 -0.043662
H  -5.24642 1.196166 0.896664
H  0.503387 0.136587 1.148486
H  4.602541 -0.646573 2.301762
H  4.806891 0.46099 -1.913673
H  6.035681 -0.278733 0.208075
H  -2.129129 -3.6221 0.828992
