program: Gaussian 09
title: 000167624
version: EM64L-G09RevD.01
frameworkgroup: C1[X(C7H14O4)]
method: RPBEPBE
basis: SDD
operation: Freq
keyword: #pfreq=noraman
keyword: PBEPBE/SDD
title: #p freq=noraman PBEPBE/SDD
converged: NO YES NO NO
title: Mulliken charges:
elementType: O O O O C C C C C C C H H H H H H H H H H H H H H
charge: -0.462055 -0.424138 -0.409325 -0.248014 0.248014 -0.110069 -0.101957 -0.725326 -0.728459 0.071242 -0.742888 0.249914 0.228647 0.208077 0.251901 0.218984 0.207468 0.257098 0.215070 0.235973 0.213637 0.258360 0.360565 0.339475 0.387806
chargesum: 0.00000
title: Mulliken charges with hydrogens summed into heavy atoms:
elementType: O O O O C C C C C C C
charge: -0.101490 -0.084663 -0.021519 -0.248014 0.248014 0.139846 0.126690 -0.046363 -0.048823 0.071242 -0.034918
polarizability: 8.98466323e+01 9.89442905e-01 9.59940399e+01 -1.99546810e+00 -2.15049443e+00 8.32309812e+01
1716.lowfreq: -17.6375 -0.0012 -0.0008 -0.0007 5.4845 14.6305 62.6287 69.0049 115.1845
frequency: 62.4695 68.6189 115.1514 148.1456 166.1195 198.9760 205.5344 218.7303 239.1835 275.4528 288.1918 309.9109 313.5810 341.0764 383.3685 397.9339 425.6290 445.5814 485.5746 538.9393 592.1898 629.8413 688.4255 700.3866 869.5208 879.8143 914.6692 927.2868 952.1435 973.3138 989.8977 1041.4826 1055.1353 1083.2747 1110.9640 1142.0497 1154.8612 1186.5675 1240.6635 1276.0464 1298.4216 1314.1546 1320.9162 1357.9774 1368.5591 1382.6611 1391.4585 1407.2802 1457.0646 1468.5971 1472.6519 1478.9587 1485.4581 1496.2852 1623.1207 2974.2684 2978.0856 2980.9710 2991.7312 2999.2030 3060.2087 3069.1335 3095.0125 3097.4500 3100.3648 3115.2306 3479.6671 3498.6783 3561.8837
redmass: 8.4277 2.7119 3.0148 3.7772 3.6332 1.2104 1.2688 2.0173 1.1613 3.6825 3.8083 2.7593 1.3549 2.0355 3.2751 1.7521 2.8322 2.9448 2.8463 3.2696 1.6071 2.7310 3.6639 3.5925 2.6976 2.5214 2.4446 1.2355 1.6303 1.9726 2.6187 2.6453 2.1231 2.0001 2.2333 1.9615 2.5832 2.0130 1.2471 1.6679 1.4614 1.3559 1.4098 1.4103 1.5232 1.2055 1.3183 1.2024 1.0440 1.0441 1.0511 1.0490 1.0498 1.0554 8.5872 1.0681 1.0472 1.0468 1.0802 1.0376 1.0961 1.0981 1.0982 1.0981 1.0988 1.1005 1.0652 1.0640 1.0655
irintensity: 0.7010 1.5051 1.0601 1.1167 0.7898 4.3354 3.5754 0.8394 1.7610 15.4032 31.3689 24.1802 82.5857 59.9684 28.2047 17.7673 36.9176 6.6752 3.9722 10.0694 67.3100 64.9302 6.1479 57.1401 3.0786 29.2180 18.2350 2.6672 30.7186 82.9383 29.8544 143.5039 88.1381 17.0645 11.3959 41.9055 11.0983 6.3661 40.9036 46.6349 53.3080 3.2598 17.9880 5.1011 6.3523 25.8901 40.5646 12.8676 8.1400 4.2821 1.7461 6.1302 13.8376 14.5609 209.3841 14.8415 32.3436 36.4327 11.2099 15.5136 47.6601 37.1643 22.6686 24.4029 15.3608 13.5410 35.2245 29.9321 4.9975
temp: 298.150 k
press: 1.00000 atm
elementType: 8 8 8 8 6 6 6 6 6 6 6 1 1 1 1 1 1 1 1 1 1 1 1 1 1
symmnumber: 1
zpe: 540485.7 jmol-1
zpe.correction: 0.205860 hartree
zpe.thermalcorrener: 0.219292 hartree
zpe.thermalcorrenthalpy: 0.220236 hartree
zpe.thermalcorrgfe: 0.167379 hartree
zpe.sumelectzpe: -575.126099 hartree
zpe.sumelectthermal: -575.112668 hartree
zpe.sumelectthermalent: -575.111724 hartree
zpe.sumelectthermalfe: -575.164581 hartree
dipole: -1.9110 0.3562 3.1463
dipole: 3.6984
quadrupole: -69.0210 -65.9142 -67.7998
quadrupole: 4.4237 0.7103 2.2395
quadrupole: -1.4426 1.6641 -0.2215 4.4237 0.7103 2.2395
hfenergy: -575.3319596 hartree
pointgroup: C01 [X(C7H14O4)]
dipole: -0.7071702 0.3801877 1.2134837 debye
dipolederiv: -0.6061276 -0.053511 0.0410488 -0.031502 -0.2586444 0.0123884 -0.0059798 0.0698292 -0.7386948 -0.4676843 0.210792 -0.1892313 0.2153334 -0.8174514 -0.0001218 -0.2149146 -0.0058974 -0.3776108 -0.4008777 -0.0256882 0.1631934 0.0199606 -0.3071288 -0.2554576 0.1784873 -0.2040032 -1.0422364 -0.3070831 0.1253236 -0.0038147 0.1158016 -0.8456772 0.3342901 0.0289036 0.1153185 -0.7665103 0.0966682 0.2255668 -0.0564958 0.1474161 -0.1870542 -0.0338759 -0.0768616 0.0263699 0.428046 0.0866389 0.0989612 -0.003578 0.0656952 0.1355446 0.0063569 -0.0382105 -0.0985565 0.1040634 0.4751687 -0.2343015 0.0174499 -0.1328375 0.6496562 -0.0459488 0.1538254 -0.1083217 0.2600996 0.0440953 -0.0379246 0.0271883 -0.0322921 0.0156727 0.0438933 0.0363495 0.0258776 -0.0874671 -0.058739 -0.0055186 -0.0532711 -0.0418159 0.0565804 0.0455533 -0.0266561 0.0742592 -0.0248219 0.2291056 -0.2120076 -0.1224334 -0.2788871 1.1394002 -0.1866846 -0.1953132 0.0247471 1.2697414 -0.1248091 -0.1012853 0.0501017 -0.0516318 -0.0203328 0.0419306 0.0048233 0.0523129 0.0015123 0.0302422 0.0377401 0.0414806 0.0473436 -0.0815141 -0.046565 0.0352697 -0.0263062 0.0136128 0.0054566 0.051377 0.0422477 0.0162257 -0.0172506 -0.0113146 0.0394141 -0.0371396 -0.1557992 -0.1367264 0.095602 -0.1249152 0.0848261 0.0649353 0.0327227 -0.110182 0.0177751 0.0066401 0.0682525 0.0657258 0.0323236 0.0800951 -0.0044915 -0.1083665 0.0129769 -0.0477184 0.0380558 -0.0384689 -0.143341 0.0477803 -0.1333198 -0.0534018 0.0513477 0.0133461 0.0157824 0.0726975 0.0309857 0.0549401 0.0076278 0.0985079 -0.0673646 -0.0830235 0.0520308 -0.1094255 0.0178084 0.1236328 0.019569 0.0285387 0.0288712 0.0828764 0.0636136 -0.0240042 0.0434781 -0.0982894 -0.0590014 -0.1151302 -0.0049108 -0.1478816 -0.0678825 0.0058768 0.0217561 0.0311276 0.1052344 -0.1034651 0.0059319 -0.0892622 0.0281033 0.1021315 0.0229043 -0.109646 0.021867 0.0417984 0.077384 0.0860441 0.0169905 0.0458982 -0.1271661 -0.0108417 0.0187642 -0.0172164 0.0842175 0.114903 -0.0146865 0.0052326 0.0168335 0.0861324 -0.0414418 0.0694292 -0.0190206 -0.0658419 0.3372767 -0.0314902 -0.0216867 -0.0489233 0.1714097 0.0991521 0.0031354 0.0085189 0.3521814 0.218506 -0.1516399 0.1439887 -0.1663832 0.2241881 0.0380251 0.148834 0.0409487 0.2447481 0.3646666 0.048951 0.0044065 0.0545627 0.1268325 0.0255868 -0.0155772 0.1053932 0.3168147 unknown
polarizability: 89.5626151|-0.113744|94.3178709|-2.1233969|-4.9969488|85.1911674 unknown
InChI: InChI=1S/C7H14O4/c1-4(2)7(11,5(3)8)6(9)10/h4-5,8-9,11H,1-3H3
charge 0 multiplicity 1
25 atoms
O  0.247565 -0.1826 -1.79022
O  1.868292 -1.741918 0.2327
O  -0.662518 1.552065 1.32922
O  -0.514719 2.239042 -0.877598
C  0.046094 -0.1023 -0.342778
C  -1.040194 -1.183906 -0.005859
C  1.41601 -0.360049 0.411803
C  -1.221636 -1.491594 1.500275
C  -2.396808 -0.822587 -0.654161
C  -0.410483 1.32724 -0.021288
C  2.549058 0.512361 -0.132679
H  -0.657403 -2.087873 -0.521653
H  1.240907 -0.146232 1.486871
H  -0.293695 -1.828156 2.001216
H  -1.58555 -0.606155 2.048038
H  -1.96612 -2.300268 1.617464
H  -2.868109 0.044063 -0.151623
H  -2.263756 -0.584703 -1.722554
H  -3.097181 -1.67332 -0.573351
H  3.472402 0.315744 0.436596
H  2.311286 1.588541 -0.053806
H  2.727684 0.260019 -1.190609
H  0.242013 0.743454 -2.156647
H  1.248317 -2.35985 0.696658
H  -0.926557 2.503881 1.461383
