program: Gaussian 09
title: 000167638
version: EM64L-G09RevD.01
frameworkgroup: C1[X(C14H15N3O)]
method: RPBEPBE
basis: SDD
operation: Freq
keyword: #p
keyword: freq=noraman
keyword: PBEPBE/SDD
title: #p freq=noraman PBEPBE/SDD
converged: YES YES NO NO
title: Mulliken charges:
elementType: O N N N C C C C C C C C C C C C C C H H H H H H H H H H H H H H H
charge: -0.481882 -0.112273 -0.130242 -0.683621 0.359809 0.286295 0.320427 0.153244 -0.535407 -0.001517 -0.374937 -0.294263 -0.360583 -0.837824 -0.419203 -0.301718 -0.231508 -0.218022 0.250986 0.214818 0.265111 0.288667 0.219018 0.219092 0.225252 0.225354 0.246193 0.269936 0.224322 0.223164 0.329377 0.311059 0.350876
chargesum: 0.00000
title: Mulliken charges with hydrogens summed into heavy atoms:
elementType: O N N N C C C C C C C C C C C C C C
charge: -0.131007 -0.112273 -0.130242 -0.043185 0.359809 0.286295 0.320427 0.153244 -0.284421 -0.001517 -0.160119 -0.029152 -0.071916 -0.141025 0.018908 -0.031782 -0.007186 0.005142
polarizability: 4.35935032e+02 -3.31067845e+01 1.91771912e+02 -6.11950732e-02 -9.35919778e-02 7.74056377e+01
1716.lowfreq: -6.1119 -1.2144 -0.0003 0.0003 0.0005 5.1792 16.6161 48.5971 53.6513
frequency: 16.4694 48.5885 53.6245 81.7648 109.6140 155.4402 162.9999 178.6239 184.4474 197.4832 242.0013 250.3596 268.9508 287.7416 305.9361 372.3922 373.2000 389.8497 423.9922 437.2625 454.3478 456.6328 492.6671 527.8699 542.9351 559.9168 578.6708 591.5665 642.6088 720.1476 737.4543 743.8656 769.5338 782.8046 804.3452 827.8889 882.4784 889.2608 915.4834 938.0794 968.7425 972.1266 977.0995 985.0834 994.3919 1015.4619 1024.6801 1031.4896 1044.1745 1086.6682 1120.8380 1145.3774 1161.9072 1164.3081 1192.0851 1194.9264 1205.7878 1236.4520 1276.2501 1287.5736 1327.9735 1344.6719 1376.9925 1386.7092 1397.1048 1399.6704 1432.1739 1439.4225 1454.0677 1472.2090 1474.1254 1485.9593 1504.4196 1570.1353 1583.8417 1601.8370 1625.4878 1644.7777 2952.3135 2954.4748 3000.5738 3019.7299 3089.6109 3115.7914 3125.2581 3142.5058 3145.9614 3166.1167 3167.4493 3180.5629 3563.5654 3589.7896 3703.0996
redmass: 3.9086 5.0371 5.0610 3.3920 4.4239 3.5108 4.7538 1.3313 1.8229 5.7865 1.4049 2.8046 4.5080 3.9114 3.1211 4.8788 3.3142 1.2582 1.3318 4.6237 2.6022 2.5277 5.7237 3.5271 5.3460 4.8847 5.5835 3.0911 6.4632 2.4288 5.3149 3.3118 4.0699 1.5434 4.8873 1.4951 7.2145 1.3065 1.4100 3.5497 1.4020 1.3619 8.0227 1.6408 1.3431 1.6747 1.4429 2.0887 1.5176 2.3914 1.4681 1.3402 1.4339 1.1104 2.2207 1.0635 2.0134 3.5142 1.4089 1.5122 3.1483 9.2543 2.7892 1.9847 2.1051 2.4749 2.5864 2.4979 1.1380 2.4474 1.0453 1.3251 3.4723 6.9800 7.2064 6.2300 3.9214 1.3312 1.0396 1.0556 1.1050 1.0976 1.0951 1.0892 1.0859 1.0916 1.0923 1.0941 1.0950 1.0953 1.0450 1.0665 1.1036
irintensity: 0.0027 1.3051 0.5666 8.3310 1.1775 0.9882 5.5226 5.9094 22.8238 0.8661 100.4590 46.4041 12.5848 3.8084 0.0091 9.0106 35.5713 126.9791 126.0623 3.1515 10.9418 0.0198 33.6915 0.0187 10.1900 15.1353 11.1769 5.8887 3.4206 18.0812 0.8984 16.7232 5.3153 52.2519 2.5580 44.0541 2.5969 0.0906 17.0266 0.0467 2.6075 2.3765 135.4239 8.7588 0.0298 1.4984 14.8953 11.7190 6.3332 2.1927 92.4839 49.8197 4.7970 14.8972 9.5048 0.4409 0.5724 75.3642 2.4472 13.5111 234.4592 146.0157 0.3923 0.9258 0.1705 15.0252 8.1621 13.8568 12.0566 9.5390 14.2136 9.9644 90.3108 90.4816 4.4000 3.8599 114.7777 412.4505 59.3736 20.7205 36.9931 27.2827 10.2516 30.8235 4.6529 5.9599 31.8033 9.7667 12.9084 17.4256 186.2602 5.9116 26.4443
temp: 298.150 k
press: 1.00000 atm
elementType: 8 7 7 7 6 6 6 6 6 6 6 6 6 6 6 6 6 6 1 1 1 1 1 1 1 1 1 1 1 1 1 1 1
symmnumber: 1
zpe: 687392.8 jmol-1
zpe.correction: 0.261814 hartree
zpe.thermalcorrener: 0.278823 hartree
zpe.thermalcorrenthalpy: 0.279767 hartree
zpe.thermalcorrgfe: 0.216253 hartree
zpe.sumelectzpe: -780.640867 hartree
zpe.sumelectthermal: -780.623858 hartree
zpe.sumelectthermalent: -780.622913 hartree
zpe.sumelectthermalfe: -780.686428 hartree
dipole: -6.2801 2.0810 -0.0164
dipole: 6.6159
quadrupole: -74.2224 -85.6090 -112.5279
quadrupole: -4.7884 0.0825 -0.0227
quadrupole: 16.5640 5.1775 -21.7415 -4.7884 0.0825 -0.0227
hfenergy: -780.9026807 hartree
pointgroup: C01 [X(C14H15N3O1)]
dipole: 2.5278537 0.1155718 -0.6096983 debye
polarizability: 439.5894501|-0.9850643|82.775398|-13.9435375|-23.679357|182.7477333 unknown
InChI: InChI=1S/C14H15N3O/c1-10-8-12(6-7-13(10)15)16-17-14-5-3-2-4-11(14)9-18/h2-8,18H,9,15H2,1H3
charge 0 multiplicity 1
33 atoms
O  -3.973346 0.915107 -3.006092
N  0.123389 0.047696 0.64822
N  -0.793162 0.26674 -0.267847
N  5.57857 0.325651 -0.805676
C  3.837435 -0.046663 0.882115
C  -3.150864 0.409869 -0.781962
C  4.23078 0.260206 -0.464187
C  1.46513 0.136905 0.19397
C  2.464931 -0.100932 1.178349
C  -2.142606 0.176879 0.203198
C  3.230631 0.499941 -1.458533
C  1.871018 0.440616 -1.139737
C  -4.509771 0.344364 -0.403878
C  4.890424 -0.301065 1.944491
C  -2.748971 0.722543 -2.212621
C  -2.510239 -0.118334 1.546521
C  -4.870455 0.051934 0.930975
C  -3.868238 -0.179887 1.906463
H  2.127646 -0.332014 2.195202
H  3.545403 0.73387 -2.483676
H  1.100515 0.623246 -1.89483
H  -5.268395 0.52513 -1.169331
H  -2.11505 1.63325 -2.227896
H  -2.138787 -0.111868 -2.616023
H  5.53713 -1.164789 1.687588
H  5.550474 0.578228 2.090964
H  4.422052 -0.522417 2.917317
H  -1.712312 -0.291573 2.274838
H  -5.929196 0.004672 1.210476
H  -4.152181 -0.406728 2.940528
H  6.305149 0.161587 -0.115442
H  5.860392 0.544006 -1.757322
H  -3.722393 1.11993 -3.940062
