program: Gaussian 09
title: 000167604
version: EM64L-G09RevD.01
frameworkgroup: C1[X(C6H10O2)]
method: RPBEPBE
basis: SDD
operation: Freq
keyword: #pfreq=noraman
keyword: PBEPBE/SDD
title: #p freq=noraman PBEPBE/SDD
converged: YES YES NO NO
title: Mulliken charges:
elementType: O O C C C C C C H H H H H H H H H H
charge: -0.154176 -0.129496 -0.025568 -0.529118 -0.702044 -0.703271 0.175128 -0.129371 0.228856 0.249630 0.238229 0.196226 0.217625 0.249772 0.223753 0.211924 0.204301 0.177601
chargesum: 0.00000
title: Mulliken charges with hydrogens summed into heavy atoms:
elementType: O O C C C C C C
charge: -0.154176 -0.129496 0.203288 -0.041260 -0.038422 -0.063293 0.175128 0.048230
polarizability: 8.45319910e+01 -2.04336993e+00 6.67514666e+01 -9.26484396e-01 -4.50993856e+00 5.37328715e+01
1716.lowfreq: -23.4975 -11.8411 -0.0011 -0.0010 -0.0006 1.8915 40.2224 70.1749 107.2723
frequency: 39.7588 69.8510 107.2500 137.7733 202.6370 235.8091 257.0374 317.6681 335.6750 405.6568 432.2022 448.4690 710.9414 787.5179 823.4349 856.8306 917.1503 932.4172 954.3590 966.4415 1037.7319 1097.7006 1147.8367 1183.1921 1212.8057 1281.7835 1323.1870 1351.3910 1373.1372 1380.2852 1398.1219 1414.0027 1465.9548 1471.9598 1483.0793 1490.5519 1611.5940 1655.0039 2864.6042 2933.4026 2969.3543 2974.2176 2975.7602 3000.7091 3061.0401 3069.0352 3075.4133 3090.4750
redmass: 5.2665 2.9029 2.3367 4.1517 1.0430 1.1084 4.6195 3.1765 3.1433 2.2158 2.5768 2.8582 4.9730 1.9481 2.4615 3.8255 1.2073 1.6574 1.5889 1.8036 2.2986 1.7122 2.3639 1.8028 1.3933 1.4484 1.4972 1.5964 1.2185 1.2100 1.2051 1.1004 1.0500 1.0490 1.0569 1.0466 10.7894 8.5227 1.0861 1.0614 1.0363 1.0556 1.0733 1.0856 1.0990 1.0986 1.0988 1.0992
irintensity: 1.4817 11.9860 2.0102 3.7825 0.0457 0.3026 3.0583 1.1706 2.9252 1.2000 0.3869 0.0992 26.9147 1.6609 1.3482 20.1896 4.4897 13.0433 6.2988 6.1815 30.7332 3.7706 5.3251 10.1730 5.7336 19.9067 7.3799 28.3056 1.9246 25.8784 6.3487 31.9632 3.8078 8.4050 6.0452 24.9739 104.0763 18.7736 103.2847 29.4048 33.3538 24.0731 3.2028 15.7554 21.5289 50.4860 56.6075 27.9384
temp: 298.150 k
press: 1.00000 atm
elementType: 8 8 6 6 6 6 6 6 1 1 1 1 1 1 1 1 1 1
symmnumber: 1
zpe: 384792.1 jmol-1
zpe.correction: 0.146560 hartree
zpe.thermalcorrener: 0.156304 hartree
zpe.thermalcorrenthalpy: 0.157248 hartree
zpe.thermalcorrgfe: 0.111114 hartree
zpe.sumelectzpe: -384.412749 hartree
zpe.sumelectthermal: -384.403005 hartree
zpe.sumelectthermalent: -384.402061 hartree
zpe.sumelectthermalfe: -384.448195 hartree
dipole: 3.2809 -3.1087 1.2401
dipole: 4.6868
quadrupole: -60.0023 -49.1962 -48.1095
quadrupole: 4.4917 -1.7816 1.5149
quadrupole: -7.5663 3.2398 4.3265 4.4917 -1.7816 1.5149
hfenergy: -384.5593085 hartree
pointgroup: C01 [X(C6H10O2)]
dipole: -1.3449336 1.1685334 0.4751114 debye
dipolederiv: -0.5781622 -0.0011562 0.0166318 0.0756493 -0.6197078 -0.1559974 0.0567621 -0.1617826 -0.3405299 -0.8159583 -0.0031368 0.004095 0.036089 -0.3688161 -0.0356735 0.0028814 -0.0353208 -0.2923564 0.1718104 0.0096372 0.0002625 0.0232616 0.105398 0.0011971 0.0416745 -0.0267696 0.1138026 -0.4105824 0.1434673 0.0510464 0.3028636 -0.1891813 -0.0931595 0.0685739 -0.0387332 0.1049587 -0.0319907 0.0215727 -0.0008943 0.0098148 -0.0317551 0.0863509 -0.0267035 0.0860595 0.0458299 -0.0549538 0.0446574 -0.0001637 0.0203259 0.0197365 0.024957 -0.0202624 0.0372953 0.0959581 0.9388388 -0.1515023 -0.087367 -0.2922256 0.5502097 0.1816935 -0.1300756 0.1627755 0.2288586 0.6639801 -0.0677306 -0.023547 0.0343482 0.6561841 0.2113543 0.0241381 0.2135075 0.2190049 0.0519873 0.0228381 0.0297325 -0.0139938 0.0119452 -0.0664302 0.0146799 -0.0507256 -0.1164788 0.0618344 -0.0060078 0.032226 -0.0868966 -0.0324544 0.1040592 0.0305655 0.1095801 0.0300794 0.0396388 0.0083214 -0.0107396 -0.058217 0.0921309 -0.0488609 -0.0540571 -0.0898659 -0.0753028 0.0918358 -0.0082258 0.0121103 0.012894 0.0128846 -0.1322862 0.0242026 -0.0502705 -0.1346332 -0.1025545 -0.1534321 -0.0129804 -0.1278144 0.0148899 0.0046427 -0.031114 -0.0148079 0.0706422 -0.0297718 0.1411288 -0.0247086 0.1222662 0.0171393 0.0239608 -0.0203222 -0.0051474 0.0808792 -0.137472 -0.0796296 -0.0262062 -0.1382352 0.0135883 -0.0293678 -0.0264354 -0.0199135 0.0952106 0.0813949 -0.0124964 0.0316139 0.0302552 -0.0642527 0.1405225 0.0002987 0.1441284 -0.0519305 0.0746335 0.0031407 -0.0242809 0.0387344 0.0263947 -0.0855485 0.0412352 -0.1268612 -0.1202725 -0.0145084 0.0885541 0.0331691 0.0108803 -0.2143339 -0.1314141 0.0039583 -0.1331481 0.04628 unknown
polarizability: 84.711925|-0.6569845|67.1323664|-0.8735322|3.6649703|53.1720378 unknown
InChI: InChI=1S/C6H10O2/c1-5(2)3-6(8)4-7/h4-5H,3H2,1-2H3
charge 0 multiplicity 1
18 atoms
O  0.960536 -1.148549 -0.737447
O  3.296975 0.373127 0.003413
C  -1.723683 -0.147033 -0.142454
C  -0.451138 0.705021 0.067355
C  -1.836125 -1.254132 0.933108
C  -2.978452 0.755793 -0.147012
C  0.862382 -0.009719 -0.219377
C  2.133999 0.799865 0.154775
H  -1.634319 -0.64237 -1.129903
H  -0.473969 1.606321 -0.587429
H  -0.417346 1.110382 1.102764
H  -1.917708 -0.812297 1.945549
H  -2.737859 -1.869519 0.76151
H  -0.961344 -1.926579 0.911968
H  -3.891457 0.154529 -0.308942
H  -2.929299 1.518638 -0.946936
H  -3.091906 1.282303 0.820545
H  1.932313 1.816721 0.582111
